program: Orca
programVersion: 5.0.2
elementType: Cl F O O O O O N C C C C C C C C C C C C C C C C C C C C C H H H H H H H H H H H H H H H H H H H H H H H
charge: 0
multiplicity: 1
keywords: wb97x-d3
keywords: def2-TZVPP
keywords: def2/J RIJCOSX
keywords: DEFGRID2
keywords: scfconv7
keywords: smallprint printgap noloewdin
keywords: NOSOSCF
formula: C21H23ClFNO5
InChI: InChI=1/C21H23ClFNO5/c1-2-3-6-9-28-19(25)12-29-18-11-17(16(23)10-15(18)22)24-20(26)13-7-4-5-8-14(13)21(24)27/h10-11H,2-9,12H2,1H3
52 atoms
Cl 3.889076 2.239794 2.960001
F  -1.137091 2.214537 2.751844
O  -2.027506 -0.492032 1.981568
O  -0.993356 1.956794 -1.706624
O  3.632156 1.031038 0.38095
O  2.750592 -1.1751 -2.219357
O  3.212094 -1.660351 -0.077079
N  -1.210329 0.903986 0.335379
C  -5.418675 -0.651133 -1.065002
C  -4.720143 -0.551296 -2.420369
C  -4.435178 -0.970728 0.06201
C  -3.687685 0.576756 -2.44742
C  -3.209721 -0.152393 -0.103712
C  -2.88972 0.540042 -1.197725
C  -2.132763 0.022107 0.90029
C  -1.604353 1.240148 -0.959038
C  0.005185 1.266359 0.934563
C  1.211192 0.979376 0.306449
C  0.019152 1.891081 2.167475
C  2.421478 1.281469 0.913938
C  -0.151816 -3.60421 -2.252255
C  1.206836 2.187009 2.804504
C  0.634583 -2.345755 -1.905568
C  2.399594 1.880044 2.176967
C  -1.563942 -3.613072 -1.672161
C  2.055535 -2.416744 -2.434356
C  -1.601947 -3.709396 -0.153442
C  3.69305 0.534134 -0.932291
C  3.194493 -0.898219 -1.006986
H  -5.921896 0.295404 -0.847268
H  -6.195575 -1.416291 -1.098118
H  -4.219925 -1.499538 -2.640219
H  -5.455001 -0.394894 -3.211202
H  -4.88573 -0.784569 1.040023
H  -4.165579 -2.03177 0.053926
H  -3.032689 0.486509 -3.317415
H  -4.177489 1.551602 -2.539049
H  1.164082 0.50966 -0.665515
H  0.387266 -4.487158 -1.892314
H  -0.208035 -3.703143 -3.340364
H  0.651493 -2.202652 -0.822755
H  0.131989 -1.473048 -2.335205
H  1.198033 2.664026 3.775604
H  -2.099211 -2.715997 -2.001224
H  -2.110172 -4.460553 -2.094487
H  2.610015 -3.245957 -1.990471
H  2.062692 -2.55023 -3.515787
H  -2.626805 -3.785311 0.21332
H  -1.066273 -4.595208 0.195608
H  -1.149828 -2.843517 0.332128
H  4.747374 0.55217 -1.217699
H  3.152948 1.175275 -1.63537
elementType: Cl F O N C H
totalener: -1805.21374304 hartree
nucrepener: 3124.56093725 hartree
electener: -4929.77468029 hartree
oneelecener: -8686.84432409 hartree
twoeener: 3757.06964380 hartree
cpcmener: -0.03900347 hartree
kineticenergy: 1798.94683201 hartree
xcener: -147.727669483537 hartree
chargesum: -0.0000000
charge: -0.070686 -0.208175 -0.397878 -0.399389 -0.305039 -0.282617 -0.427607 -0.030469 -0.125826 -0.154214 -0.080880 -0.068442 -0.084097 -0.057231 0.300306 0.295614 0.014897 -0.175693 0.181679 0.288772 -0.129514 -0.096857 -0.131954 -0.036976 -0.072495 0.012828 -0.309739 0.032574 0.353918 0.080164 0.081157 0.083595 0.086414 0.099940 0.107528 0.093503 0.104849 0.123764 0.071163 0.078551 0.083482 0.071560 0.133496 0.027265 0.080938 0.106025 0.113808 0.099367 0.098938 0.073005 0.138547 0.128127
qa: -0.0707 -0.2082 -0.3979 -0.3994 -0.3050 -0.2826 -0.4276 -0.0305 -0.1258 -0.1542 -0.0809 -0.0684 -0.0841 -0.0572 0.3003 0.2956 0.0149 -0.1757 0.1817 0.2888 -0.1295 -0.0969 -0.1320 -0.0370 -0.0725 0.0128 -0.3097 0.0326 0.3539 0.0802 0.0812 0.0836 0.0864 0.0999 0.1075 0.0935 0.1048 0.1238 0.0712 0.0786 0.0835 0.0716 0.1335 0.0273 0.0809 0.1060 0.1138 0.0994 0.0989 0.0730 0.1385 0.1281
va: 1.2402 1.0879 2.1144 2.1146 2.1144 2.1421 2.0730 3.0465 3.9008 3.9225 3.9156 3.9020 3.6569 3.6478 4.1627 4.1806 3.6927 3.9367 4.1117 3.9515 3.9179 3.9644 3.8345 3.9057 3.8669 3.8606 3.9345 3.8821 4.1178 1.0072 1.0101 1.0043 1.0108 1.0164 1.0074 1.0167 1.0046 1.0398 1.0094 1.0115 1.0168 1.0146 1.0141 1.0214 1.0073 1.0114 1.0005 1.0011 1.0063 1.0017 0.9899 1.0072
dispcorr: -0.031482929 hartree
energy: -1805.245225969208
dipole: -33.26255 31.39082 -1.87172 -38.54885 37.70066 -0.84819 -34.56360 31.68372 -2.87988
magnitude: 3.53786 au
magnitude: 8.99253 debye
