program: Orca
programVersion: 5.0.2
elementType: Cl F O O O O O N C C C C C C C C C C C C C C C C C C C C C H H H H H H H H H H H H H H H H H H H H H H H
charge: 0
multiplicity: 1
keywords: wb97x-d3
keywords: def2-TZVPP
keywords: def2/J RIJCOSX
keywords: DEFGRID2
keywords: scfconv7
keywords: smallprint printgap noloewdin
keywords: NOSOSCF
formula: C21H23ClFNO5
InChI: InChI=1/C21H23ClFNO5/c1-2-3-6-9-28-19(25)12-29-18-11-17(16(23)10-15(18)22)24-20(26)13-7-4-5-8-14(13)21(24)27/h10-11H,2-9,12H2,1H3
52 atoms
Cl 3.611136 3.087412 2.248408
F  -1.414769 3.297102 2.29435
O  -1.589208 1.358526 -1.668804
O  -2.484161 0.549847 2.715577
O  3.136819 0.98136 0.388691
O  2.41419 -2.131792 -1.137887
O  2.751413 -1.661057 1.02708
N  -1.70179 1.136322 0.625842
C  -5.527907 -0.870309 -1.208307
C  -6.111571 -0.41262 0.128075
C  -4.425953 0.069021 -1.702645
C  -5.057746 -0.395174 1.237064
C  -3.528935 0.410821 -0.572043
C  -3.800914 0.194371 0.715397
C  -2.181591 1.022222 -0.677596
C  -2.636978 0.626427 1.525933
C  -0.433246 1.615407 0.985017
C  0.715139 1.015671 0.482053
C  -0.313082 2.686327 1.85106
C  1.97266 1.475367 0.846587
C  2.587326 -4.218231 -3.247145
C  0.923583 3.138293 2.262436
C  1.535504 -4.102618 -2.150624
C  2.057829 2.532123 1.75722
C  2.028215 -4.821331 -4.529204
C  2.037124 -3.493817 -0.862079
C  3.083313 -4.986416 -5.61172
C  3.109405 0.032761 -0.644596
C  2.734899 -1.343837 -0.133115
H  -5.117569 -1.878364 -1.098057
H  -6.31687 -0.934655 -1.958889
H  -6.530329 0.591322 0.014105
H  -6.936966 -1.063649 0.419496
H  -3.855319 -0.390729 -2.513186
H  -4.854199 0.986731 -2.118432
H  -5.410797 0.169828 2.103272
H  -4.857876 -1.408238 1.601204
H  0.590394 0.181834 -0.194864
H  3.418793 -4.832609 -2.885149
H  3.00939 -3.234221 -3.472491
H  1.156878 -5.098252 -1.901931
H  0.673405 -3.531016 -2.508608
H  0.997305 3.966366 2.955047
H  1.575954 -5.793299 -4.308757
H  1.21751 -4.18763 -4.902025
H  1.255594 -3.506024 -0.099646
H  2.902263 -4.037315 -0.473673
H  2.658555 -5.408892 -6.523621
H  3.537139 -4.028793 -5.87531
H  3.886357 -5.650556 -5.285754
H  4.126507 -0.015792 -1.041801
H  2.457284 0.336051 -1.469425
elementType: Cl F O N C H
totalener: -1805.21834982 hartree
nucrepener: 2931.72646251 hartree
electener: -4736.94481232 hartree
oneelecener: -8301.54829017 hartree
twoeener: 3564.60347785 hartree
cpcmener: -0.03986354 hartree
kineticenergy: 1798.95884577 hartree
xcener: -147.726086305684 hartree
chargesum: 0.0000000
charge: -0.070965 -0.209007 -0.402649 -0.397600 -0.305441 -0.281061 -0.435347 -0.063677 -0.135308 -0.136162 -0.075984 -0.074427 -0.069811 -0.076431 0.316765 0.325618 -0.015561 -0.159350 0.179094 0.287537 -0.102217 -0.105213 -0.117208 -0.015055 -0.087571 -0.006603 -0.275173 0.021400 0.377357 0.078672 0.080930 0.078334 0.081178 0.093609 0.101224 0.095003 0.102000 0.139012 0.058271 0.064259 0.071461 0.070492 0.134075 0.056046 0.058087 0.112651 0.111956 0.090002 0.077743 0.077531 0.143601 0.133916
qa: -0.0710 -0.2090 -0.4026 -0.3976 -0.3054 -0.2811 -0.4353 -0.0637 -0.1353 -0.1362 -0.0760 -0.0744 -0.0698 -0.0764 0.3168 0.3256 -0.0156 -0.1593 0.1791 0.2875 -0.1022 -0.1052 -0.1172 -0.0151 -0.0876 -0.0066 -0.2752 0.0214 0.3774 0.0787 0.0809 0.0783 0.0812 0.0936 0.1012 0.0950 0.1020 0.1390 0.0583 0.0643 0.0715 0.0705 0.1341 0.0560 0.0581 0.1127 0.1120 0.0900 0.0777 0.0775 0.1436 0.1339
va: 1.2400 1.0861 2.1161 2.1253 2.1083 2.1285 2.0726 3.0579 3.9129 3.9153 3.9197 3.9178 3.6839 3.6980 4.1895 4.1935 3.7195 3.9519 4.1248 3.9218 3.8418 3.9708 3.9428 3.8936 3.8801 3.8646 3.9458 3.8976 4.0783 1.0066 1.0095 1.0066 1.0094 1.0157 1.0048 1.0151 1.0052 1.0287 1.0110 1.0205 1.0146 1.0164 1.0141 1.0065 1.0067 1.0031 0.9978 1.0042 1.0012 1.0012 0.9920 1.0029
dispcorr: -0.024507430 hartree
energy: -1805.242857245655
dipole: -13.23504 11.47350 -1.76154 -53.25117 51.38577 -1.86540 -43.94033 41.49368 -2.44665
magnitude: 3.54526 au
magnitude: 9.01132 debye
