program: Orca
programVersion: 5.0.2
elementType: Cl F O O O O O N C C C C C C C C C C C C C C C C C C C C C H H H H H H H H H H H H H H H H H H H H H H H
charge: 0
multiplicity: 1
keywords: wb97x-d3
keywords: def2-TZVPP
keywords: def2/J RIJCOSX
keywords: DEFGRID2
keywords: scfconv7
keywords: smallprint printgap noloewdin
keywords: NOSOSCF
formula: C21H23ClFNO5
InChI: InChI=1/C21H23ClFNO5/c1-2-3-6-9-28-19(25)12-29-18-11-17(16(23)10-15(18)22)24-20(26)13-7-4-5-8-14(13)21(24)27/h10-11H,2-9,12H2,1H3
52 atoms
Cl 3.593793 3.07194 2.259127
F  -1.433439 3.263856 2.21345
O  -1.55536 1.382329 -1.722637
O  -2.499611 0.501269 2.636505
O  3.161314 0.941253 0.42833
O  2.954037 -2.287354 -1.040746
O  2.653121 -1.660824 1.090325
N  -1.684908 1.097616 0.5631
C  -5.588846 -0.6895 -1.331359
C  -6.153359 -0.248458 0.018678
C  -4.446218 0.214845 -1.796703
C  -5.100888 -0.312502 1.12685
C  -3.535679 0.480614 -0.656991
C  -3.819683 0.239161 0.623404
C  -2.164454 1.040881 -0.74324
C  -2.643228 0.606063 1.447828
C  -0.420929 1.571824 0.943555
C  0.7362 0.963726 0.472422
C  -0.319898 2.653692 1.798592
C  1.985175 1.433622 0.853245
C  1.944268 -4.101843 -3.146194
C  0.906797 3.115303 2.226587
C  2.90865 -4.461227 -2.021663
C  2.050748 2.504567 1.748945
C  2.176417 -4.929717 -4.403832
C  2.7050 -3.674557 -0.747446
C  1.223438 -4.568376 -5.532726
C  3.188991 -0.021111 -0.590925
C  2.894306 -1.408845 -0.061261
H  -5.22319 -1.717304 -1.25229
H  -6.378969 -0.696215 -2.083409
H  -6.526748 0.776147 -0.063299
H  -7.007138 -0.8711 0.289735
H  -3.89749 -0.241265 -2.623335
H  -4.833308 1.164023 -2.179646
H  -5.429592 0.238907 2.010922
H  -4.945126 -1.344302 1.457912
H  0.62765 0.115206 -0.189078
H  2.038726 -3.041505 -3.398222
H  0.914637 -4.24404 -2.80018
H  3.943559 -4.345187 -2.358162
H  2.791454 -5.517109 -1.760384
H  0.966703 3.953452 2.908113
H  3.208543 -4.791829 -4.740685
H  2.075141 -5.99286 -4.165221
H  1.683782 -3.785904 -0.374117
H  3.392038 -4.011826 0.031461
H  0.183128 -4.731886 -5.244479
H  1.323089 -3.518853 -5.816925
H  1.414284 -5.167368 -6.42444
H  4.203566 -0.007915 -0.995266
H  2.514025 0.223253 -1.418431
elementType: Cl F O N C H
totalener: -1805.21886119 hartree
nucrepener: 2924.17088956 hartree
electener: -4729.38975075 hartree
oneelecener: -8286.68707555 hartree
twoeener: 3557.29732480 hartree
cpcmener: -0.03987494 hartree
kineticenergy: 1798.96086020 hartree
xcener: -147.726960192217 hartree
chargesum: 0.0000000
charge: -0.071783 -0.210223 -0.403887 -0.397848 -0.305680 -0.283183 -0.435847 -0.064932 -0.135697 -0.135317 -0.074374 -0.075519 -0.072712 -0.073773 0.319652 0.324613 -0.011818 -0.159431 0.179653 0.282936 -0.099804 -0.108751 -0.115430 -0.012087 -0.087569 -0.006737 -0.274489 0.012562 0.386406 0.078519 0.080990 0.078212 0.081132 0.093368 0.100841 0.094599 0.101828 0.142023 0.061909 0.059125 0.069948 0.070580 0.134082 0.057082 0.056540 0.106590 0.115043 0.077815 0.077692 0.089819 0.146607 0.136727
qa: -0.0718 -0.2102 -0.4039 -0.3978 -0.3057 -0.2832 -0.4358 -0.0649 -0.1357 -0.1353 -0.0744 -0.0755 -0.0727 -0.0738 0.3197 0.3246 -0.0118 -0.1594 0.1797 0.2829 -0.0998 -0.1088 -0.1154 -0.0121 -0.0876 -0.0067 -0.2745 0.0126 0.3864 0.0785 0.0810 0.0782 0.0811 0.0934 0.1008 0.0946 0.1018 0.1420 0.0619 0.0591 0.0699 0.0706 0.1341 0.0571 0.0565 0.1066 0.1150 0.0778 0.0777 0.0898 0.1466 0.1367
va: 1.2395 1.0843 2.1158 2.1249 2.1038 2.1331 2.0716 3.0533 3.9135 3.9150 3.9203 3.9186 3.6887 3.6919 4.1881 4.1939 3.7056 3.9505 4.1293 3.9275 3.8415 3.9765 3.9407 3.8850 3.8817 3.8692 3.9459 3.8927 4.0933 1.0066 1.0095 1.0067 1.0094 1.0159 1.0048 1.0153 1.0050 1.0196 1.0216 1.0110 1.0169 1.0149 1.0144 1.0066 1.0065 0.9974 1.0019 1.0009 1.0014 1.0043 0.9979 0.9984
dispcorr: -0.024317736 hartree
energy: -1805.243178926138
dipole: -15.64620 14.28410 -1.36209 -52.00997 50.11779 -1.89218 -43.40065 40.95261 -2.44803
magnitude: 3.38061 au
magnitude: 8.59282 debye
