program: Orca
programVersion: 5.0.2
elementType: Cl F O O O O O N C C C C C C C C C C C C C C C C C C C C C H H H H H H H H H H H H H H H H H H H H H H H
charge: 0
multiplicity: 1
keywords: wb97x-d3
keywords: def2-TZVPP
keywords: def2/J RIJCOSX
keywords: DEFGRID2
keywords: scfconv7
keywords: smallprint printgap noloewdin
keywords: NOSOSCF
formula: C21H23ClFNO5
InChI: InChI=1/C21H23ClFNO5/c1-2-3-6-9-28-19(25)12-29-18-11-17(16(23)10-15(18)22)24-20(26)13-7-4-5-8-14(13)21(24)27/h10-11H,2-9,12H2,1H3
52 atoms
Cl 3.562595 3.088975 2.227438
F  -1.464234 3.275952 2.191525
O  -1.603849 1.339838 -1.721097
O  -2.520464 0.525334 2.656599
O  3.128747 0.941481 0.418621
O  2.976877 -2.291771 -1.045591
O  2.605052 -1.661081 1.072567
N  -1.719235 1.090241 0.569094
C  -5.928378 0.002435 -1.208184
C  -5.932009 -0.914413 0.015381
C  -4.516447 0.221895 -1.755176
C  -5.127982 -0.32256 1.173906
C  -3.583141 0.467263 -0.628432
C  -3.855216 0.236284 0.656406
C  -2.207444 1.014426 -0.733049
C  -2.672843 0.614125 1.46771
C  -0.453566 1.571571 0.935992
C  0.702966 0.96096 0.46655
C  -0.351167 2.66248 1.779644
C  1.952271 1.435747 0.840356
C  2.102635 -4.135188 -3.183413
C  0.875885 3.130026 2.199875
C  3.012681 -4.473939 -2.007945
C  2.019064 2.515693 1.725468
C  2.407026 -4.974379 -4.4181
C  2.735186 -3.680274 -0.752345
C  1.511564 -4.635099 -5.600285
C  3.161845 -0.020182 -0.600901
C  2.875733 -1.410155 -0.072191
H  -6.562199 -0.415177 -1.991523
H  -6.362425 0.969172 -0.93724
H  -6.956458 -1.101915 0.340048
H  -5.507208 -1.884792 -0.257489
H  -4.178046 -0.652637 -2.320579
H  -4.494907 1.059508 -2.45663
H  -5.692447 0.472282 1.672536
H  -4.929934 -1.075816 1.940176
H  0.594266 0.106023 -0.186619
H  2.20026 -3.076616 -3.441516
H  1.058385 -4.283979 -2.887813
H  4.061652 -4.347129 -2.293279
H  2.895165 -5.529051 -1.744329
H  0.936597 3.974969 2.873066
H  3.454033 -4.830224 -4.702436
H  2.302958 -6.03575 -4.172534
H  1.698912 -3.804447 -0.427483
H  3.388524 -4.001279 0.061522
H  1.755333 -5.242559 -6.473224
H  0.458979 -4.805778 -5.365643
H  1.616653 -3.587819 -5.891347
H  4.17574 0.000068 -1.006296
H  2.483774 0.219528 -1.427317
elementType: Cl F O N C H
totalener: -1805.21883797 hartree
nucrepener: 2918.29384767 hartree
electener: -4723.51268564 hartree
oneelecener: -8274.97168809 hartree
twoeener: 3551.45900246 hartree
cpcmener: -0.03968468 hartree
kineticenergy: 1798.95330997 hartree
xcener: -147.725500527985 hartree
chargesum: -0.0000000
charge: -0.071850 -0.210367 -0.403792 -0.397593 -0.305958 -0.283243 -0.435401 -0.063487 -0.137300 -0.136224 -0.073934 -0.073506 -0.075761 -0.073534 0.319919 0.325890 -0.013500 -0.158305 0.179422 0.282294 -0.100308 -0.108032 -0.115422 -0.012903 -0.088272 -0.006234 -0.274699 0.012635 0.386497 0.081577 0.078957 0.081228 0.078380 0.101192 0.094186 0.100722 0.094023 0.142427 0.062339 0.059237 0.070090 0.070586 0.134067 0.057156 0.056784 0.107101 0.114382 0.089879 0.077768 0.077825 0.146401 0.136659
qa: -0.0718 -0.2104 -0.4038 -0.3976 -0.3060 -0.2832 -0.4354 -0.0635 -0.1373 -0.1362 -0.0739 -0.0735 -0.0758 -0.0735 0.3199 0.3259 -0.0135 -0.1583 0.1794 0.2823 -0.1003 -0.1080 -0.1154 -0.0129 -0.0883 -0.0062 -0.2747 0.0126 0.3865 0.0816 0.0790 0.0812 0.0784 0.1012 0.0942 0.1007 0.0940 0.1424 0.0623 0.0592 0.0701 0.0706 0.1341 0.0572 0.0568 0.1071 0.1144 0.0899 0.0778 0.0778 0.1464 0.1367
va: 1.2395 1.0840 2.1160 2.1252 2.1029 2.1338 2.0719 3.0560 3.9145 3.9144 3.9189 3.9183 3.6907 3.6902 4.1912 4.1943 3.7099 3.9497 4.1268 3.9291 3.8410 3.9760 3.9404 3.8851 3.8813 3.8684 3.9461 3.8909 4.0967 1.0094 1.0066 1.0095 1.0067 1.0046 1.0152 1.0045 1.0155 1.0192 1.0216 1.0111 1.0168 1.0150 1.0144 1.0066 1.0064 0.9973 1.0022 1.0043 1.0010 1.0014 0.9987 0.9983
dispcorr: -0.024265236 hartree
energy: -1805.243103202624
dipole: -14.28418 12.94960 -1.33458 -52.26700 50.37632 -1.89069 -43.22050 40.80494 -2.41556
magnitude: 3.34526 au
magnitude: 8.50296 debye
