program: Orca
programVersion: 5.0.2
elementType: Cl F O O O O O N C C C C C C C C C C C C C C C C C C C C C H H H H H H H H H H H H H H H H H H H H H H H
charge: 0
multiplicity: 1
keywords: wb97x-d3
keywords: def2-TZVPP
keywords: def2/J RIJCOSX
keywords: DEFGRID2
keywords: scfconv7
keywords: smallprint printgap noloewdin
keywords: NOSOSCF
formula: C21H23ClFNO5
InChI: InChI=1/C21H23ClFNO5/c1-2-3-6-9-28-19(25)12-29-18-11-17(16(23)10-15(18)22)24-20(26)13-7-4-5-8-14(13)21(24)27/h10-11H,2-9,12H2,1H3
52 atoms
Cl 4.073191 2.331989 0.534423
F  -0.657447 2.891151 -1.070153
O  -1.770149 0.157754 -1.877637
O  -2.144294 1.015648 2.571345
O  2.945383 0.129666 1.951896
O  2.718771 -1.935529 0.361686
O  2.061312 -3.331089 1.984801
N  -1.589731 0.721252 0.35199
C  -5.782322 -1.282379 -0.289506
C  -6.144535 -0.344656 0.860924
C  -4.693126 -0.690158 -1.186476
C  -4.951025 -0.079801 1.781101
C  -3.622944 -0.107717 -0.339771
C  -3.734114 0.147661 0.964603
C  -2.252135 0.252977 -0.779756
C  -2.440048 0.679753 1.455684
C  -0.239775 1.104914 0.398062
C  0.663701 0.388702 1.175114
C  0.206316 2.194464 -0.327361
C  1.99967 0.758789 1.232134
C  1.537952 -1.138959 -2.224318
C  1.530616 2.578829 -0.297915
C  2.604941 -2.207296 -2.008692
C  2.416984 1.863405 0.484469
C  1.620536 -0.441984 -3.578419
C  2.494639 -2.910221 -0.674988
C  1.326663 -1.346447 -4.765932
C  2.64646 -1.097298 2.566379
C  2.434349 -2.250056 1.603471
H  -5.434091 -2.236982 0.116249
H  -6.668373 -1.501662 -0.887317
H  -6.502536 0.605093 0.452834
H  -6.966788 -0.764806 1.442269
H  -4.279487 -1.450648 -1.853505
H  -5.106078 0.088485 -1.836457
H  -5.14081 0.778934 2.42976
H  -4.77992 -0.929402 2.450413
H  0.291494 -0.468675 1.720879
H  1.617036 -0.378934 -1.443119
H  0.547923 -1.593301 -2.109625
H  3.605246 -1.776196 -2.119162
H  2.523048 -2.98689 -2.771361
H  1.86079 3.433101 -0.874264
H  0.910042 0.389292 -3.581242
H  2.611254 0.008735 -3.694308
H  1.503498 -3.353327 -0.552063
H  3.238139 -3.70485 -0.582308
H  0.338497 -1.803235 -4.677925
H  1.344953 -0.785358 -5.70165
H  2.054701 -2.153735 -4.862842
H  1.785289 -1.035165 3.239805
H  3.511045 -1.339894 3.18845
elementType: Cl F O N C H
totalener: -1805.21655894 hartree
nucrepener: 3106.06590450 hartree
electener: -4911.28246344 hartree
oneelecener: -8650.27682221 hartree
twoeener: 3738.99435877 hartree
cpcmener: -0.03683510 hartree
kineticenergy: 1798.94368417 hartree
xcener: -147.727204613899 hartree
chargesum: -0.0000000
charge: -0.070482 -0.210061 -0.412816 -0.400688 -0.310089 -0.258170 -0.455687 -0.035660 -0.135257 -0.135792 -0.073677 -0.073923 -0.032610 -0.089111 0.302164 0.323202 -0.031231 -0.160762 0.205342 0.251982 -0.058938 -0.121925 -0.112843 0.027889 -0.100936 -0.013257 -0.277419 0.015248 0.382123 0.078529 0.080922 0.077865 0.081275 0.093354 0.100879 0.094862 0.101037 0.141585 0.000912 0.062987 0.073329 0.072923 0.132495 0.066306 0.060055 0.102666 0.120482 0.080186 0.090433 0.078601 0.128912 0.142788
qa: -0.0705 -0.2101 -0.4128 -0.4007 -0.3101 -0.2582 -0.4557 -0.0357 -0.1353 -0.1358 -0.0737 -0.0739 -0.0326 -0.0891 0.3022 0.3232 -0.0312 -0.1608 0.2053 0.2520 -0.0589 -0.1219 -0.1128 0.0279 -0.1009 -0.0133 -0.2774 0.0152 0.3821 0.0785 0.0809 0.0779 0.0813 0.0934 0.1009 0.0949 0.1010 0.1416 0.0009 0.0630 0.0733 0.0729 0.1325 0.0663 0.0601 0.1027 0.1205 0.0802 0.0904 0.0786 0.1289 0.1428
va: 1.2404 1.0837 2.1008 2.1187 2.1026 2.1516 2.0592 3.0367 3.9137 3.9156 3.9174 3.9187 3.7103 3.7175 4.1719 4.1795 3.6498 3.8766 4.0936 3.8997 3.8537 3.9778 3.9469 3.8422 3.8891 3.8648 3.9401 3.9172 4.0984 1.0069 1.0094 1.0067 1.0092 1.0156 1.0048 1.0147 1.0050 1.0216 1.0514 1.0171 1.0142 1.0146 1.0162 1.0123 1.0086 1.0048 0.9992 0.9996 1.0047 0.9986 0.9997 0.9922
dispcorr: -0.029886303 hartree
energy: -1805.246445243736
dipole: -21.10049 19.46231 -1.63818 -28.04268 27.18007 -0.86261 -21.37209 21.05175 -0.32035
magnitude: 1.87892 au
magnitude: 4.77584 debye
