program: Orca
programVersion: 5.0.2
elementType: Cl F O O O O O N C C C C C C C C C C C C C C C C C C C C C H H H H H H H H H H H H H H H H H H H H H H H
charge: 0
multiplicity: 1
keywords: wb97x-d3
keywords: def2-TZVPP
keywords: def2/J RIJCOSX
keywords: DEFGRID2
keywords: scfconv7
keywords: smallprint printgap noloewdin
keywords: NOSOSCF
formula: C21H23ClFNO5
InChI: InChI=1/C21H23ClFNO5/c1-2-3-6-9-28-19(25)12-29-18-11-17(16(23)10-15(18)22)24-20(26)13-7-4-5-8-14(13)21(24)27/h10-11H,2-9,12H2,1H3
52 atoms
Cl 4.082748 3.007619 1.411891
F  -0.945908 3.221042 1.369844
O  -1.133491 1.2598 -2.456717
O  -1.969279 0.367459 1.921049
O  3.628378 0.737172 -0.254348
O  2.893748 -2.694598 -0.77048
O  3.027123 -1.522582 1.143666
N  -1.210638 0.974196 -0.169869
C  -5.141076 -0.843899 -1.98278
C  -5.673058 -0.432017 -0.610856
C  -4.02049 0.07889 -2.466214
C  -4.589572 -0.491402 0.467588
C  -3.085537 0.347259 -1.346869
C  -3.332784 0.090702 -0.061923
C  -1.719996 0.916549 -1.464381
C  -2.141468 0.469352 0.735392
C  0.055656 1.465121 0.183295
C  1.207792 0.824548 -0.251632
C  0.164683 2.592082 0.976207
C  2.460921 1.292241 0.117226
C  0.082423 -3.028533 0.425521
C  1.39603 3.076041 1.365769
C  0.931009 -4.065505 -0.302901
C  2.535595 2.423999 0.933343
C  -1.416121 -3.310175 0.358808
C  2.427441 -3.901817 -0.13408
C  -1.988959 -3.290484 -1.051095
C  3.605087 -0.484582 -0.944507
C  3.136106 -1.617222 -0.050266
H  -4.763979 -1.869651 -1.931533
H  -5.951803 -0.846575 -2.712604
H  -6.067654 0.586493 -0.666531
H  -6.506963 -1.074479 -0.324932
H  -3.485583 -0.363388 -3.310654
H  -4.428257 1.027342 -2.83186
H  -4.905548 0.040107 1.368613
H  -4.403769 -1.525091 0.778963
H  1.089971 -0.048688 -0.878706
H  0.265176 -2.032395 0.010323
H  0.388928 -2.984732 1.474585
H  0.694471 -4.079543 -1.370137
H  0.6886 -5.064406 0.07465
H  1.462932 3.954224 1.994432
H  -1.626899 -4.277952 0.824768
H  -1.934737 -2.564766 0.968539
H  2.717828 -3.915683 0.917082
H  2.955858 -4.709396 -0.639525
H  -1.757531 -2.352437 -1.5614
H  -1.597241 -4.102503 -1.665256
H  -3.074621 -3.398395 -1.037334
H  4.636518 -0.683598 -1.24494
H  3.010819 -0.436434 -1.862289
elementType: Cl F O N C H
totalener: -1805.21520612 hartree
nucrepener: 3126.45548444 hartree
electener: -4931.67069056 hartree
oneelecener: -8691.10694848 hartree
twoeener: 3759.43625792 hartree
cpcmener: -0.04062384 hartree
kineticenergy: 1798.95488122 hartree
xcener: -147.730420916722 hartree
chargesum: 0.0000000
charge: -0.070360 -0.209892 -0.401393 -0.398862 -0.308221 -0.283724 -0.427018 -0.027168 -0.157828 -0.124816 -0.065570 -0.074033 -0.124642 -0.055012 0.340801 0.287432 0.020831 -0.192503 0.187002 0.262976 -0.084327 -0.106146 -0.113981 -0.018262 -0.112965 0.001202 -0.315457 0.031435 0.354033 0.083983 0.085224 0.078503 0.080822 0.095847 0.106379 0.098899 0.103167 0.146305 0.027637 0.083384 0.074239 0.075052 0.133459 0.076608 0.060331 0.104438 0.114873 0.080657 0.103172 0.100258 0.141722 0.131507
qa: -0.0704 -0.2099 -0.4014 -0.3989 -0.3082 -0.2837 -0.4270 -0.0272 -0.1578 -0.1248 -0.0656 -0.0740 -0.1246 -0.0550 0.3408 0.2874 0.0208 -0.1925 0.1870 0.2630 -0.0843 -0.1061 -0.1140 -0.0183 -0.1130 0.0012 -0.3155 0.0314 0.3540 0.0840 0.0852 0.0785 0.0808 0.0958 0.1064 0.0989 0.1032 0.1463 0.0276 0.0834 0.0742 0.0751 0.1335 0.0766 0.0603 0.1044 0.1149 0.0807 0.1032 0.1003 0.1417 0.1315
va: 1.2409 1.0854 2.1176 2.1111 2.1130 2.1373 2.0699 3.0184 3.9179 3.9039 3.8942 3.9100 3.6572 3.6089 4.1528 4.1713 3.6432 3.9478 4.1293 3.9317 3.8887 3.9854 3.8781 3.9028 3.8817 3.8711 3.9370 3.8747 4.1405 1.0092 1.0122 1.0074 1.0104 1.0155 1.0043 1.0175 1.0052 1.0135 1.0162 1.0181 1.0120 1.0144 1.0152 1.0087 1.0212 1.0166 0.9994 0.9922 1.0027 1.0023 0.9930 1.0007
dispcorr: -0.032215230 hartree
energy: -1805.247421347128
dipole: -35.03190 33.30410 -1.72780 -45.98069 43.67925 -2.30144 -15.58825 13.65452 -1.93373
magnitude: 3.46716 au
magnitude: 8.81283 debye
