program: Orca
programVersion: 5.0.2
elementType: Cl F O O O O O N C C C C C C C C C C C C C C C C C C C C C H H H H H H H H H H H H H H H H H H H H H H H
charge: 0
multiplicity: 1
keywords: wb97x-d3
keywords: def2-TZVPP
keywords: def2/J RIJCOSX
keywords: DEFGRID2
keywords: scfconv7
keywords: smallprint printgap noloewdin
keywords: NOSOSCF
formula: C21H23ClFNO5
InChI: InChI=1/C21H23ClFNO5/c1-2-3-6-9-28-19(25)12-29-18-11-17(16(23)10-15(18)22)24-20(26)13-7-4-5-8-14(13)21(24)27/h10-11H,2-9,12H2,1H3
52 atoms
Cl 4.017704 2.150611 0.424396
F  -0.718281 2.455816 -1.241262
O  -1.446147 -1.731664 -0.348157
O  -2.559433 2.42433 1.124893
O  2.946674 -0.029387 1.933778
O  3.198142 -2.020466 0.21088
O  1.905398 -3.369414 1.455808
N  -1.622672 0.451916 0.380447
C  -5.963876 -1.203827 -0.307954
C  -6.252297 -0.220137 0.825655
C  -4.554762 -1.791268 -0.210948
C  -5.302574 0.97876 0.797661
C  -3.591056 -0.711192 0.112585
C  -3.919553 0.507241 0.543549
C  -2.11453 -0.79416 -0.000139
C  -2.677263 1.293941 0.733801
C  -0.271142 0.829905 0.386831
C  0.650833 0.176942 1.195402
C  0.155219 1.871175 -0.417586
C  1.985066 0.562008 1.199663
C  2.165314 -0.98563 -2.448561
C  1.46241 2.309597 -0.393269
C  1.95333 -2.373843 -1.855423
C  2.371029 1.649499 0.412649
C  0.968308 -0.493132 -3.252761
C  3.085508 -2.843759 -0.966772
C  1.227927 0.843013 -3.931454
C  2.712228 -1.333007 2.407763
C  2.538837 -2.357047 1.300038
H  -6.6973 -2.011423 -0.298711
H  -6.074213 -0.691984 -1.268398
H  -7.283878 0.129893 0.765123
H  -6.152185 -0.734689 1.785891
H  -4.507416 -2.561264 0.566222
H  -4.272156 -2.286937 -1.142855
H  -5.591343 1.685654 0.012934
H  -5.348781 1.53685 1.735973
H  0.294864 -0.624557 1.829293
H  3.05417 -1.002537 -3.088766
H  2.376093 -0.26183 -1.656578
H  1.859973 -3.105174 -2.664317
H  1.011241 -2.415644 -1.301983
H  1.771151 3.137055 -1.018188
H  0.698631 -1.238494 -4.007756
H  0.100842 -0.408007 -2.591112
H  2.96393 -3.889977 -0.685943
H  4.046531 -2.741839 -1.470839
H  0.337522 1.216457 -4.439852
H  1.539408 1.603659 -3.212709
H  2.020972 0.761507 -4.677794
H  1.859128 -1.389741 3.088607
H  3.597967 -1.607345 2.986486
elementType: Cl F O N C H
totalener: -1805.21558185 hartree
nucrepener: 3148.60490611 hartree
electener: -4953.82048796 hartree
oneelecener: -8735.77528264 hartree
twoeener: 3781.95479467 hartree
cpcmener: -0.03662451 hartree
kineticenergy: 1798.95039337 hartree
xcener: -147.728145425481 hartree
chargesum: 0.0000000
charge: -0.070948 -0.212401 -0.414432 -0.397950 -0.311728 -0.264999 -0.443718 -0.027447 -0.135330 -0.135749 -0.073302 -0.074085 -0.036454 -0.086141 0.294570 0.332400 0.010704 -0.171940 0.162601 0.228407 -0.106395 -0.130709 -0.126896 0.061929 -0.093500 0.001988 -0.287231 0.022589 0.368745 0.080906 0.078429 0.081255 0.077710 0.100958 0.094686 0.101083 0.093818 0.143146 0.077662 0.036055 0.084457 0.070419 0.136479 0.073823 0.050821 0.108704 0.108934 0.093791 0.077589 0.088357 0.119405 0.138934
qa: -0.0709 -0.2124 -0.4144 -0.3980 -0.3117 -0.2650 -0.4437 -0.0274 -0.1353 -0.1357 -0.0733 -0.0741 -0.0365 -0.0861 0.2946 0.3324 0.0107 -0.1719 0.1626 0.2284 -0.1064 -0.1307 -0.1269 0.0619 -0.0935 0.0020 -0.2872 0.0226 0.3687 0.0809 0.0784 0.0813 0.0777 0.1010 0.0947 0.1011 0.0938 0.1431 0.0777 0.0361 0.0845 0.0704 0.1365 0.0738 0.0508 0.1087 0.1089 0.0938 0.0776 0.0884 0.1194 0.1389
va: 1.2407 1.0738 2.0977 2.1259 2.0967 2.1465 2.0605 3.0267 3.9146 3.9152 3.9186 3.9163 3.7074 3.7103 4.1680 4.1840 3.6544 3.8932 4.0458 3.9150 3.8524 3.9465 3.8744 3.8120 3.8833 3.8596 3.9368 3.9005 4.1202 1.0095 1.0067 1.0093 1.0066 1.0053 1.0154 1.0047 1.0154 1.0215 1.0148 1.0237 1.0191 1.0347 1.0147 1.0088 1.0054 1.0175 0.9980 1.0040 0.9989 1.0027 1.0033 0.9898
dispcorr: -0.032101033 hartree
energy: -1805.247682880515
dipole: -21.55110 20.09949 -1.45161 -20.51362 19.74193 -0.77169 -18.79872 18.56296 -0.23576
magnitude: 1.66080 au
magnitude: 4.22143 debye
