program: Orca
programVersion: 5.0.2
elementType: Cl F O O O O O N C C C C C C C C C C C C C C C C C C C C C H H H H H H H H H H H H H H H H H H H H H H H
charge: 0
multiplicity: 1
keywords: wb97x-d3
keywords: def2-TZVPP
keywords: def2/J RIJCOSX
keywords: DEFGRID2
keywords: scfconv7
keywords: smallprint printgap noloewdin
keywords: NOSOSCF
formula: C21H23ClFNO5
InChI: InChI=1/C21H23ClFNO5/c1-2-3-6-9-28-19(25)12-29-18-11-17(16(23)10-15(18)22)24-20(26)13-7-4-5-8-14(13)21(24)27/h10-11H,2-9,12H2,1H3
52 atoms
Cl 4.099787 1.299463 -2.203294
F  -0.794408 2.407233 -1.877459
O  -2.02025 -1.449073 -2.71327
O  -1.715146 1.184527 0.989198
O  3.20652 -1.243794 -1.264772
O  2.909376 -1.233898 1.3561
O  2.068541 -3.321068 1.38392
N  -1.485942 -0.067502 -0.938883
C  -6.095191 -0.949031 -0.750797
C  -5.818788 -0.763651 0.741585
C  -4.885107 -1.52579 -1.488507
C  -4.674243 0.220637 0.990755
C  -3.654046 -0.830576 -1.036538
C  -3.56463 -0.057956 0.045268
C  -2.329707 -0.866202 -1.714378
C  -2.17737 0.466131 0.148752
C  -0.153286 0.242263 -1.255003
C  0.850886 -0.704418 -1.10187
C  0.171469 1.503523 -1.714636
C  2.172597 -0.394625 -1.389276
C  1.243837 0.816251 4.035614
C  1.477232 1.839906 -2.007894
C  1.735831 0.411713 2.650901
C  2.470431 0.892464 -1.845657
C  0.489452 2.140486 4.024117
C  2.471771 -0.912081 2.684197
C  -0.034365 2.53183 5.397931
C  2.989434 -2.477614 -0.643783
C  2.589965 -2.397395 0.824043
H  -6.959532 -1.598696 -0.894621
H  -6.356457 0.016865 -1.192352
H  -6.719635 -0.417867 1.250393
H  -5.563802 -1.730599 1.18431
H  -4.78739 -2.598975 -1.29567
H  -4.998812 -1.429535 -2.5704
H  -5.012344 1.253016 0.854253
H  -4.319533 0.161224 2.022065
H  0.56202 -1.684579 -0.747174
H  2.090606 0.885015 4.72764
H  0.589951 0.033563 4.43566
H  2.392861 1.187567 2.248642
H  0.884569 0.341504 1.968406
H  1.718045 2.832312 -2.362431
H  1.148777 2.927006 3.6457
H  -0.339487 2.075119 3.315295
H  3.363862 -0.852019 3.311599
H  1.838319 -1.707721 3.078414
H  0.777152 2.634961 6.120302
H  -0.568369 3.481549 5.365442
H  -0.724554 1.781219 5.786791
H  3.937046 -3.01632 -0.709209
H  2.243971 -3.086963 -1.166094
totalener: -1805.18591589 hartree
nucrepener: 3057.86160690 hartree
electener: -4863.04752279 hartree
oneelecener: -8553.57360091 hartree
twoeener: 3690.52607812 hartree
kineticenergy: 1799.02440920 hartree
xcener: -147.729976353569 hartree
chargesum: -0.0000000
charge: -0.050746 -0.198457 -0.303577 -0.339975 -0.278543 -0.247560 -0.350960 -0.072079 -0.135329 -0.135961 -0.078871 -0.075023 -0.101923 -0.045416 0.259089 0.261564 -0.009753 -0.165158 0.204534 0.306706 -0.132722 -0.127458 -0.053291 0.003989 -0.069417 0.004511 -0.258857 -0.003924 0.298879 0.080319 0.076624 0.080623 0.076238 0.093073 0.095520 0.094530 0.093048 0.105308 0.057502 0.056443 0.067011 0.044583 0.114629 0.048934 0.064691 0.092342 0.095059 0.071649 0.085543 0.069952 0.116835 0.115274
qa: -0.0507 -0.1985 -0.3036 -0.3400 -0.2785 -0.2476 -0.3510 -0.0721 -0.1353 -0.1360 -0.0789 -0.0750 -0.1019 -0.0454 0.2591 0.2616 -0.0098 -0.1652 0.2045 0.3067 -0.1327 -0.1275 -0.0533 0.0040 -0.0694 0.0045 -0.2589 -0.0039 0.2989 0.0803 0.0766 0.0806 0.0762 0.0931 0.0955 0.0945 0.0930 0.1053 0.0575 0.0564 0.0670 0.0446 0.1146 0.0489 0.0647 0.0923 0.0951 0.0716 0.0855 0.0700 0.1168 0.1153
va: 1.2607 1.1024 2.2136 2.1611 2.1332 2.1565 2.1597 3.0058 3.8985 3.8987 3.9270 3.9223 3.6617 3.6630 4.2485 4.1975 3.6828 3.9677 4.1622 3.8303 3.9263 3.9933 3.8651 3.9355 3.8868 3.8559 3.9513 3.9198 4.1571 1.0116 1.0088 1.0117 1.0086 1.0081 1.0186 1.0082 1.0189 1.0413 1.0115 1.0094 1.0174 1.0339 1.0234 1.0087 1.0222 0.9994 1.0243 1.0027 1.0062 1.0037 0.9941 1.0021
dispcorr: -0.027638290 hartree
energy: -1805.213554178326
dipole: -27.00757 25.76694 -1.24062 -2.00888 1.95661 -0.05227 41.28783 -40.69209 0.59574
magnitude: 1.37724 au
magnitude: 3.50067 debye
