program: Orca
programVersion: 5.0.2
elementType: Cl F O O O O O N C C C C C C C C C C C C C C C C C C C C C H H H H H H H H H H H H H H H H H H H H H H H
charge: 0
multiplicity: 1
keywords: wb97x-d3
keywords: def2-TZVPP
keywords: def2/J RIJCOSX
keywords: DEFGRID2
keywords: scfconv7
keywords: smallprint printgap noloewdin
keywords: NOSOSCF
formula: C21H23ClFNO5
InChI: InChI=1/C21H23ClFNO5/c1-2-3-6-9-28-19(25)12-29-18-11-17(16(23)10-15(18)22)24-20(26)13-7-4-5-8-14(13)21(24)27/h10-11H,2-9,12H2,1H3
52 atoms
Cl 3.970146 2.146986 -0.8886
F  -0.653572 2.719454 0.990372
O  -1.312918 -1.56005 0.771349
O  -2.727892 2.276546 -1.237649
O  2.803536 -0.183821 -2.063648
O  2.626853 -2.119509 -0.267454
O  1.557874 -3.493447 -1.681088
N  -1.64222 0.479184 -0.269138
C  -5.821009 -1.611587 0.205194
C  -6.267585 -0.151471 0.285671
C  -4.41195 -1.80822 0.768604
C  -5.361794 0.768692 -0.53531
C  -3.526752 -0.723815 0.274162
C  -3.942487 0.401779 -0.305074
C  -2.041036 -0.717729 0.325162
C  -2.756847 1.217012 -0.683015
C  -0.309081 0.885621 -0.432034
C  0.557935 0.140493 -1.220947
C  0.161086 2.020031 0.201593
C  1.889522 0.503519 -1.357938
C  2.106278 -0.77039 2.2614
C  1.468654 2.431203 0.041774
C  2.714176 -2.16084 2.115229
C  2.327919 1.671306 -0.728741
C  2.408095 -0.13002 3.610212
C  2.256057 -2.901053 0.87763
C  1.86632 1.288257 3.713253
C  2.473255 -1.461313 -2.528786
C  2.155582 -2.48144 -1.44192
H  -6.525049 -2.249707 0.740751
H  -5.838991 -1.937846 -0.838471
H  -7.298608 -0.054591 -0.056771
H  -6.256002 0.17266 1.3301
H  -4.425629 -1.795065 1.863151
H  -4.007914 -2.784055 0.490373
H  -5.587934 0.68506 -1.603264
H  -5.527785 1.817586 -0.280141
H  0.160714 -0.73726 -1.712696
H  1.023046 -0.828313 2.118537
H  2.482047 -0.121915 1.466581
H  2.433354 -2.779842 2.973408
H  3.806214 -2.098175 2.131298
H  1.820781 3.32563 0.536203
H  1.984294 -0.745459 4.409678
H  3.489412 -0.119952 3.778343
H  2.717547 -3.888951 0.809683
H  1.171981 -3.033279 0.884997
H  2.330763 1.938483 2.970167
H  0.788947 1.315566 3.541355
H  2.055624 1.721865 4.695436
H  3.346451 -1.811618 -3.082765
H  1.636628 -1.449263 -3.235434
totalener: -1805.18707951 hartree
nucrepener: 3136.19526229 hartree
electener: -4941.38234180 hartree
oneelecener: -8710.39783456 hartree
twoeener: 3769.01549276 hartree
kineticenergy: 1799.02754908 hartree
xcener: -147.733072003429 hartree
chargesum: -0.0000000
charge: -0.053075 -0.198029 -0.342411 -0.299315 -0.279070 -0.244968 -0.346799 -0.073882 -0.135092 -0.136427 -0.078543 -0.077918 -0.025471 -0.108628 0.225449 0.278449 0.033136 -0.166405 0.205223 0.284214 -0.090285 -0.173313 -0.108452 0.030171 -0.082482 -0.016532 -0.269943 0.005022 0.292541 0.080564 0.076428 0.080739 0.076590 0.093565 0.095363 0.093683 0.096013 0.105721 0.059446 0.055592 0.057843 0.067546 0.117834 0.053384 0.053592 0.108593 0.107208 0.075669 0.078328 0.092742 0.115860 0.110535
qa: -0.0531 -0.1980 -0.3424 -0.2993 -0.2791 -0.2450 -0.3468 -0.0739 -0.1351 -0.1364 -0.0785 -0.0779 -0.0255 -0.1086 0.2254 0.2784 0.0331 -0.1664 0.2052 0.2842 -0.0903 -0.1733 -0.1085 0.0302 -0.0825 -0.0165 -0.2699 0.0050 0.2925 0.0806 0.0764 0.0807 0.0766 0.0936 0.0954 0.0937 0.0960 0.1057 0.0594 0.0556 0.0578 0.0675 0.1178 0.0534 0.0536 0.1086 0.1072 0.0757 0.0783 0.0927 0.1159 0.1105
va: 1.2577 1.0985 2.1629 2.2193 2.1321 2.1496 2.1621 3.0187 3.8974 3.8985 3.9229 3.9233 3.6344 3.6867 4.2240 4.2361 3.6811 3.9504 4.0797 3.8711 3.8732 3.9632 3.9400 3.8431 3.8974 3.8683 3.9546 3.9317 4.1616 1.0118 1.0085 1.0118 1.0084 1.0082 1.0194 1.0084 1.0191 1.0364 1.0217 1.0179 1.0163 1.0150 1.0232 1.0072 1.0060 1.0046 1.0089 1.0016 1.0032 1.0085 0.9944 1.0028
dispcorr: -0.031390984 hartree
energy: -1805.218470496018
dipole: -17.72683 16.50093 -1.22590 -19.72560 19.13850 -0.58710 22.59319 -22.16581 0.42738
magnitude: 1.42484 au
magnitude: 3.62165 debye
