program: Orca
programVersion: 5.0.2
elementType: Cl F O O O O O N C C C C C C C C C C C C C C C C C C C C C H H H H H H H H H H H H H H H H H H H H H H H
charge: 0
multiplicity: 1
keywords: wb97x-d3
keywords: def2-TZVPP
keywords: def2/J RIJCOSX
keywords: DEFGRID2
keywords: scfconv7
keywords: smallprint printgap noloewdin
keywords: NOSOSCF
formula: C21H23ClFNO5
InChI: InChI=1/C21H23ClFNO5/c1-2-3-6-9-28-19(25)12-29-18-11-17(16(23)10-15(18)22)24-20(26)13-7-4-5-8-14(13)21(24)27/h10-11H,2-9,12H2,1H3
52 atoms
Cl 4.22729 2.881402 -0.410009
F  -0.732844 3.520293 0.078764
O  -1.509708 0.290105 -2.796689
O  -1.854255 1.204708 1.651324
O  3.438861 0.252917 -1.187251
O  3.009155 -1.742075 0.500965
O  2.646886 -3.23042 -1.139978
N  -1.320664 0.913882 -0.577902
C  -5.446286 -1.258519 -1.133735
C  -5.821287 -0.319886 0.013186
C  -4.385889 -0.643947 -2.050488
C  -4.622867 -0.012078 0.913463
C  -3.325862 -0.0122 -1.22519
C  -3.427897 0.257909 0.075679
C  -1.97449 0.393394 -1.697463
C  -2.150248 0.855543 0.544879
C  0.000419 1.384977 -0.557905
C  1.053732 0.539098 -0.884971
C  0.271688 2.691944 -0.200395
C  2.364801 0.989382 -0.858105
C  0.583112 -1.782042 2.361317
C  1.569952 3.156198 -0.135019
C  1.33622 -2.990221 1.815234
C  2.609391 2.308873 -0.466869
C  -0.890665 -2.062428 2.643165
C  2.800725 -2.734391 1.516853
C  -1.131424 -3.135067 3.697496
C  3.252788 -1.014983 -1.742251
C  2.919239 -2.125652 -0.758282
H  -5.064427 -2.197389 -0.722155
H  -6.333241 -1.513666 -1.715279
H  -6.210493 0.61537 -0.399448
H  -6.626669 -0.755167 0.606538
H  -3.952563 -1.396399 -2.713053
H  -4.830962 0.109054 -2.708779
H  -4.828474 0.837802 1.567949
H  -4.410334 -0.85417 1.580711
H  0.812901 -0.477645 -1.162041
H  0.656423 -0.946535 1.660538
H  1.066098 -1.439949 3.283077
H  0.838898 -3.384658 0.925096
H  1.317479 -3.801973 2.548677
H  1.766105 4.178495 0.156512
H  -1.362832 -1.131936 2.962758
H  -1.388127 -2.349973 1.71036
H  3.305003 -2.331863 2.395641
H  3.300582 -3.661728 1.231085
H  -2.192608 -3.227127 3.930206
H  -0.78836 -4.118675 3.374836
H  -0.614067 -2.894737 4.628365
H  4.202222 -1.281054 -2.211897
H  2.499079 -1.019149 -2.537702
totalener: -1805.18518646 hartree
nucrepener: 3094.64921284 hartree
electener: -4899.83439930 hartree
oneelecener: -8627.01852654 hartree
twoeener: 3727.18412724 hartree
kineticenergy: 1799.01668052 hartree
xcener: -147.730827597428 hartree
chargesum: 0.0000000
charge: -0.052780 -0.194103 -0.307530 -0.313853 -0.276608 -0.244702 -0.358111 -0.045382 -0.135233 -0.135706 -0.079706 -0.070687 -0.085798 -0.050594 0.250084 0.201921 0.033283 -0.226481 0.191759 0.334826 -0.096105 -0.113737 -0.147831 -0.019062 -0.118839 -0.011871 -0.264133 -0.016596 0.309909 0.076287 0.080558 0.076967 0.080695 0.094733 0.094582 0.097179 0.090815 0.112861 0.073897 0.066205 0.088667 0.074160 0.114539 0.085864 0.042526 0.102413 0.108952 0.084270 0.074953 0.080088 0.121852 0.120605
qa: -0.0528 -0.1941 -0.3075 -0.3139 -0.2766 -0.2447 -0.3581 -0.0454 -0.1352 -0.1357 -0.0797 -0.0707 -0.0858 -0.0506 0.2501 0.2019 0.0333 -0.2265 0.1918 0.3348 -0.0961 -0.1137 -0.1478 -0.0191 -0.1188 -0.0119 -0.2641 -0.0166 0.3099 0.0763 0.0806 0.0770 0.0807 0.0947 0.0946 0.0972 0.0908 0.1129 0.0739 0.0662 0.0887 0.0742 0.1145 0.0859 0.0425 0.1024 0.1090 0.0843 0.0750 0.0801 0.1219 0.1206
va: 1.2591 1.1089 2.2080 2.1836 2.1300 2.1602 2.1491 3.0280 3.8972 3.9008 3.9267 3.9210 3.6350 3.6375 4.2418 4.2344 3.6856 3.9682 4.1616 3.8587 3.8446 3.9757 3.8344 3.9370 3.8716 3.9059 3.9480 3.9539 4.1393 1.0089 1.0119 1.0084 1.0115 1.0196 1.0075 1.0189 1.0086 1.0303 1.0266 1.0146 1.0212 1.0171 1.0226 1.0158 1.0075 0.9966 1.0110 1.0070 0.9985 1.0017 0.9972 1.0041
dispcorr: -0.029590823 hartree
energy: -1805.214777282224
dipole: -32.29000 31.00910 -1.28090 -39.57645 38.82879 -0.74766 18.95086 -18.54989 0.40098
magnitude: 1.53639 au
magnitude: 3.90518 debye
