program: Orca
programVersion: 5.0.2
elementType: Cl F O O O O O N C C C C C C C C C C C C C C C C C C C C C H H H H H H H H H H H H H H H H H H H H H H H
charge: 0
multiplicity: 1
keywords: wb97x-d3
keywords: def2-TZVPP
keywords: def2/J RIJCOSX
keywords: DEFGRID2
keywords: scfconv7
keywords: smallprint printgap noloewdin
keywords: NOSOSCF
formula: C21H23ClFNO5
InChI: InChI=1/C21H23ClFNO5/c1-2-3-6-9-28-19(25)12-29-18-11-17(16(23)10-15(18)22)24-20(26)13-7-4-5-8-14(13)21(24)27/h10-11H,2-9,12H2,1H3
52 atoms
Cl 4.022687 2.916936 1.267389
F  -0.997083 3.185981 1.207377
O  -1.242416 1.210688 -2.56024
O  -2.066503 0.33965 1.833815
O  3.554268 0.629471 -0.357206
O  2.864962 -1.76391 0.53737
O  3.642885 -2.802966 -1.293295
N  -1.290926 0.903916 -0.269828
C  -5.607246 0.058836 -1.935248
C  -5.60433 -0.884624 -0.731879
C  -4.205138 0.245146 -2.518903
C  -4.750218 -0.339353 0.41337
C  -3.228368 0.429028 -1.416167
C  -3.470562 0.179743 -0.129872
C  -1.824761 0.901198 -1.559978
C  -2.242578 0.468653 0.656723
C  -0.01748 1.382987 0.07428
C  1.129619 0.719092 -0.338536
C  0.102307 2.527738 0.839628
C  2.388006 1.186384 0.009452
C  0.146056 -3.029244 0.668931
C  1.339858 3.001034 1.222415
C  1.460621 -3.796412 0.733762
C  2.475293 2.332234 0.805106
C  -1.025659 -3.92993 0.297823
C  2.645926 -2.994127 1.239089
C  -2.333574 -3.166832 0.160657
C  3.586822 -0.42475 -1.273565
C  3.370706 -1.808709 -0.679675
H  -6.28043 -0.317423 -2.706799
H  -6.000908 1.03243 -1.629423
H  -6.624446 -1.054986 -0.384723
H  -5.212239 -1.859624 -1.036819
H  -3.914782 -0.625508 -3.116247
H  -4.172457 1.096031 -3.203001
H  -5.272487 0.466688 0.939281
H  -4.55938 -1.107954 1.165199
H  1.005393 -0.176729 -0.929109
H  0.218988 -2.221948 -0.066251
H  -0.056092 -2.539574 1.627251
H  1.689807 -4.232134 -0.24035
H  1.351816 -4.640358 1.423424
H  1.418803 3.892124 1.829214
H  -0.803759 -4.447018 -0.640498
H  -1.135054 -4.712875 1.054152
H  2.480101 -2.678758 2.269001
H  3.555135 -3.598921 1.20927
H  -2.578612 -2.639092 1.084062
H  -2.274355 -2.425024 -0.637965
H  -3.164819 -3.832886 -0.072747
H  4.584716 -0.417363 -1.713888
H  2.881668 -0.28414 -2.102562
totalener: -1805.18440180 hartree
nucrepener: 3104.69764159 hartree
electener: -4909.88204339 hartree
oneelecener: -8647.02662349 hartree
twoeener: 3737.14458009 hartree
kineticenergy: 1799.02645071 hartree
xcener: -147.733085817812 hartree
chargesum: 0.0000000
charge: -0.053540 -0.197667 -0.307751 -0.303973 -0.279170 -0.250032 -0.356411 -0.057626 -0.136865 -0.133732 -0.065465 -0.089960 -0.092448 -0.108614 0.260046 0.235137 0.037505 -0.172588 0.182304 0.315792 -0.062888 -0.113186 -0.149546 -0.027807 -0.081707 -0.015280 -0.268628 -0.012701 0.322673 0.080455 0.076999 0.083335 0.074337 0.090667 0.096665 0.104402 0.098727 0.108693 0.013104 0.073101 0.092827 0.071177 0.114324 0.058951 0.058900 0.103221 0.109683 0.074772 0.065064 0.095493 0.130228 0.109001
qa: -0.0535 -0.1977 -0.3078 -0.3040 -0.2792 -0.2500 -0.3564 -0.0576 -0.1369 -0.1337 -0.0655 -0.0900 -0.0924 -0.1086 0.2600 0.2351 0.0375 -0.1726 0.1823 0.3158 -0.0629 -0.1132 -0.1495 -0.0278 -0.0817 -0.0153 -0.2686 -0.0127 0.3227 0.0805 0.0770 0.0833 0.0743 0.0907 0.0967 0.1044 0.0987 0.1087 0.0131 0.0731 0.0928 0.0712 0.1143 0.0590 0.0589 0.1032 0.1097 0.0748 0.0651 0.0955 0.1302 0.1090
va: 1.2588 1.1028 2.2107 2.2000 2.1252 2.1420 2.1500 2.9994 3.8981 3.8871 3.9166 3.9127 3.6020 3.6065 4.2357 4.1938 3.6971 4.0077 4.1637 3.8963 3.8428 3.9872 3.8551 3.9297 3.9317 3.9111 3.9629 3.9431 4.1506 1.0117 1.0088 1.0123 1.0096 1.0102 1.0180 1.0088 1.0148 1.0165 1.0272 1.0157 1.0237 1.0155 1.0230 1.0077 1.0102 0.9959 1.0063 1.0059 0.9959 1.0066 1.0032 1.0020
dispcorr: -0.031069327 hartree
energy: -1805.215471130235
dipole: -34.86492 33.37053 -1.49440 -42.71118 41.85027 -0.86091 -7.77645 7.69683 -0.07961
magnitude: 1.72648 au
magnitude: 4.38836 debye
