program: Orca
programVersion: 5.0.2
elementType: Cl F O O O O O N C C C C C C C C C C C C C C C C C C C C C H H H H H H H H H H H H H H H H H H H H H H H
charge: 0
multiplicity: 1
keywords: wb97x-d3
keywords: def2-TZVPP
keywords: def2/J RIJCOSX
keywords: DEFGRID2
keywords: scfconv7
keywords: smallprint printgap noloewdin
keywords: NOSOSCF
formula: C21H23ClFNO5
InChI: InChI=1/C21H23ClFNO5/c1-2-3-6-9-28-19(25)12-29-18-11-17(16(23)10-15(18)22)24-20(26)13-7-4-5-8-14(13)21(24)27/h10-11H,2-9,12H2,1H3
52 atoms
Cl 3.710933 2.509878 2.390618
F  -1.306361 2.389885 2.107253
O  -1.425812 2.021278 -1.926907
O  -2.000867 -0.761125 1.632635
O  3.51469 0.81847 0.110501
O  2.972076 -1.789844 0.138193
O  4.036241 -2.126384 -1.809102
N  -1.339707 0.700384 -0.031635
C  -5.653459 0.338155 -1.867817
C  -5.543588 -1.032757 -1.19974
C  -4.290297 0.863474 -2.323091
C  -4.677328 -0.982651 0.059786
C  -3.283587 0.619739 -1.259963
C  -3.456034 -0.185237 -0.21233
C  -1.930822 1.233495 -1.179298
C  -2.224906 -0.162309 0.620344
C  -0.124113 1.136985 0.520638
C  1.091634 0.7253 -0.006093
C  -0.136796 1.979999 1.615454
C  2.289394 1.145787 0.553217
C  0.396234 -3.196147 -0.475304
C  1.03694 2.401781 2.20339
C  1.769144 -3.855597 -0.507122
C  2.242471 1.985561 1.670338
C  -0.629822 -3.955136 -1.307763
C  2.813615 -3.195869 0.37547
C  -1.994261 -3.282663 -1.312818
C  3.68634 0.110083 -1.081819
C  3.590842 -1.403466 -0.961357
H  -6.332408 0.287134 -2.720193
H  -6.094347 1.048612 -1.162372
H  -6.536531 -1.410347 -0.951728
H  -5.106792 -1.745785 -1.905417
H  -3.970764 0.365944 -3.244652
H  -4.337685 1.927912 -2.563217
H  -5.225285 -0.528216 0.891898
H  -4.409799 -1.986784 0.395833
H  1.067896 0.055627 -0.853494
H  0.463476 -2.171065 -0.85177
H  0.041193 -3.108721 0.556688
H  2.132466 -3.920733 -1.534289
H  1.682176 -4.888501 -0.153172
H  1.013223 3.05605 3.063615
H  -0.264185 -4.051546 -2.334568
H  -0.726389 -4.975907 -0.925618
H  2.517793 -3.251889 1.422838
H  3.778068 -3.696801 0.265211
H  -2.718212 -3.846407 -1.902028
H  -2.388013 -3.19159 -0.299129
H  -1.937653 -2.277863 -1.73641
H  4.692416 0.340664 -1.433616
H  2.99875 0.441454 -1.870573
totalener: -1805.18407633 hartree
nucrepener: 3099.46945915 hartree
electener: -4904.65353549 hartree
oneelecener: -8636.57270775 hartree
twoeener: 3731.91917227 hartree
kineticenergy: 1799.01956842 hartree
xcener: -147.730538807389 hartree
chargesum: -0.0000000
charge: -0.052467 -0.200220 -0.306179 -0.305335 -0.279107 -0.252922 -0.356243 -0.062730 -0.136076 -0.130489 -0.068836 -0.095964 -0.085097 -0.107254 0.262505 0.231594 0.019136 -0.159015 0.183840 0.319539 -0.062953 -0.117042 -0.150419 -0.020149 -0.081041 -0.012172 -0.266034 -0.010874 0.324752 0.079996 0.076714 0.082604 0.074486 0.090653 0.096693 0.104404 0.098697 0.109933 0.010801 0.073262 0.091588 0.071859 0.114409 0.059448 0.058167 0.103300 0.110018 0.095194 0.072800 0.064723 0.131528 0.105973
qa: -0.0525 -0.2002 -0.3062 -0.3053 -0.2791 -0.2529 -0.3562 -0.0627 -0.1361 -0.1305 -0.0688 -0.0960 -0.0851 -0.1073 0.2625 0.2316 0.0191 -0.1590 0.1838 0.3195 -0.0630 -0.1170 -0.1504 -0.0201 -0.0810 -0.0122 -0.2660 -0.0109 0.3248 0.0800 0.0767 0.0826 0.0745 0.0907 0.0967 0.1044 0.0987 0.1099 0.0108 0.0733 0.0916 0.0719 0.1144 0.0594 0.0582 0.1033 0.1100 0.0952 0.0728 0.0647 0.1315 0.1060
va: 1.2599 1.0988 2.2115 2.1967 2.1255 2.1430 2.1484 2.9814 3.8985 3.8876 3.9173 3.9212 3.6094 3.6030 4.2414 4.1834 3.7031 4.0170 4.1669 3.8869 3.8423 3.9928 3.8580 3.9313 3.9249 3.9068 3.9601 3.9383 4.1532 1.0116 1.0088 1.0119 1.0097 1.0097 1.0180 1.0089 1.0144 1.0154 1.0283 1.0169 1.0240 1.0155 1.0234 1.0080 1.0103 0.9963 1.0067 1.0072 1.0059 0.9980 1.0038 1.0018
dispcorr: -0.030919748 hartree
energy: -1805.214996079662
dipole: -31.09313 29.63869 -1.45443 -39.54948 38.68420 -0.86528 -23.88524 23.46183 -0.42341
magnitude: 1.74452 au
magnitude: 4.43422 debye
