program: Orca
programVersion: 5.0.2
elementType: Cl F O O O O O N C C C C C C C C C C C C C C C C C C C C C H H H H H H H H H H H H H H H H H H H H H H H
charge: 0
multiplicity: 1
keywords: wb97x-d3
keywords: def2-TZVPP
keywords: def2/J RIJCOSX
keywords: DEFGRID2
keywords: scfconv7
keywords: smallprint printgap noloewdin
keywords: NOSOSCF
formula: C21H23ClFNO5
InChI: InChI=1/C21H23ClFNO5/c1-2-3-6-9-28-19(25)12-29-18-11-17(16(23)10-15(18)22)24-20(26)13-7-4-5-8-14(13)21(24)27/h10-11H,2-9,12H2,1H3
52 atoms
Cl 3.889083 2.369588 -0.050217
F  -0.75021 2.040756 1.816619
O  -1.613667 -1.712106 -0.242294
O  -2.625439 2.727658 -0.413115
O  2.670689 0.534507 -2.159602
O  2.224299 -1.891837 -1.129417
O  4.401528 -2.433662 -1.107133
N  -1.728393 0.599349 -0.289479
C  -6.10862 -1.078994 -0.004732
C  -6.387068 0.208638 -0.780593
C  -4.719601 -1.644116 -0.312232
C  -5.39842 1.317216 -0.415542
C  -3.726735 -0.540644 -0.319532
C  -4.025731 0.756956 -0.357857
C  -2.247468 -0.693731 -0.277442
C  -2.763472 1.541155 -0.352622
C  -0.368707 0.942826 -0.219969
C  0.529953 0.545776 -1.19174
C  0.094532 1.703077 0.844978
C  1.868531 0.91722 -1.13779
C  1.521205 -1.810279 1.749694
C  1.402526 2.122835 0.90713
C  2.123597 -3.023164 1.050201
C  2.28414 1.742186 -0.095857
C  1.725178 -1.8408 3.258775
C  1.836545 -3.088658 -0.439327
C  1.185484 -0.594048 3.945124
C  3.785328 -0.291627 -1.914753
C  3.506706 -1.668199 -1.337642
H  -6.18412 -0.876796 1.067549
H  -6.869286 -1.826791 -0.232852
H  -6.320438 0.006614 -1.853394
H  -7.406803 0.546931 -0.592047
H  -4.434802 -2.407274 0.4153
H  -4.710766 -2.145343 -1.285501
H  -5.44334 2.141377 -1.130711
H  -5.648211 1.755719 0.556215
H  0.195671 -0.061094 -2.021392
H  0.452406 -1.752479 1.52596
H  1.959989 -0.890527 1.351104
H  1.707404 -3.938269 1.48447
H  3.200387 -3.069265 1.228312
H  1.733771 2.749235 1.72361
H  1.238803 -2.728769 3.674104
H  2.790807 -1.949232 3.482779
H  2.325359 -3.953342 -0.89236
H  0.764862 -3.159075 -0.616482
H  1.698956 0.301945 3.592199
H  0.121333 -0.458927 3.744522
H  1.314155 -0.642327 5.026613
H  4.526781 0.180615 -1.26523
H  4.26763 -0.430193 -2.883608
totalener: -1805.18260892 hartree
nucrepener: 3126.35797136 hartree
electener: -4931.54058028 hartree
oneelecener: -8690.68007568 hartree
twoeener: 3759.13949540 hartree
kineticenergy: 1799.01812862 hartree
xcener: -147.730784832027 hartree
chargesum: -0.0000000
charge: -0.062112 -0.196333 -0.347697 -0.298129 -0.308117 -0.258312 -0.362230 -0.062381 -0.135936 -0.134695 -0.073414 -0.079341 -0.042926 -0.100636 0.233460 0.277193 0.060872 -0.152525 0.228275 0.177990 -0.072048 -0.176839 -0.138208 0.102882 -0.082533 -0.019860 -0.258852 -0.033719 0.349154 0.076619 0.080514 0.075730 0.080800 0.092941 0.092329 0.095871 0.095239 0.113864 0.061234 0.020411 0.067625 0.089806 0.121505 0.053906 0.055102 0.113796 0.113069 0.069956 0.075102 0.091471 0.114282 0.115845
qa: -0.0621 -0.1963 -0.3477 -0.2981 -0.3081 -0.2583 -0.3622 -0.0624 -0.1359 -0.1347 -0.0734 -0.0793 -0.0429 -0.1006 0.2335 0.2772 0.0609 -0.1525 0.2283 0.1780 -0.0720 -0.1768 -0.1382 0.1029 -0.0825 -0.0199 -0.2589 -0.0337 0.3492 0.0766 0.0805 0.0757 0.0808 0.0929 0.0923 0.0959 0.0952 0.1139 0.0612 0.0204 0.0676 0.0898 0.1215 0.0539 0.0551 0.1138 0.1131 0.0700 0.0751 0.0915 0.1143 0.1158
va: 1.2508 1.0992 2.1593 2.2199 2.0713 2.1159 2.1517 3.0230 3.8996 3.8980 3.9230 3.9233 3.6479 3.6739 4.2318 4.2366 3.6165 4.0281 4.0548 3.9599 3.8691 3.9658 3.8658 3.7945 3.8941 3.8645 3.9494 3.9088 4.1115 1.0086 1.0116 1.0088 1.0120 1.0192 1.0086 1.0192 1.0075 1.0362 1.0199 1.0263 1.0176 1.0229 1.0213 1.0081 1.0074 1.0103 1.0050 1.0038 1.0036 1.0083 1.0165 1.0051
dispcorr: -0.031532305 hartree
energy: -1805.214141224518
dipole: -21.78039 19.80478 -1.97561 -26.78597 26.24765 -0.53832 13.62711 -13.56553 0.06158
magnitude: 2.04857 au
magnitude: 5.20704 debye
