program: Orca
programVersion: 5.0.2
elementType: Cl F O O O O O N C C C C C C C C C C C C C C C C C C C C C H H H H H H H H H H H H H H H H H H H H H H H
charge: 0
multiplicity: 1
keywords: wb97x-d3
keywords: def2-TZVPP
keywords: def2/J RIJCOSX
keywords: DEFGRID2
keywords: scfconv7
keywords: smallprint printgap noloewdin
keywords: NOSOSCF
formula: C21H23ClFNO5
InChI: InChI=1/C21H23ClFNO5/c1-2-3-6-9-28-19(25)12-29-18-11-17(16(23)10-15(18)22)24-20(26)13-7-4-5-8-14(13)21(24)27/h10-11H,2-9,12H2,1H3
52 atoms
Cl 4.144371 2.920791 1.122281
F  -0.661462 3.600261 -0.159847
O  -1.552247 1.468299 -2.012252
O  -1.794363 0.013882 2.297615
O  3.265443 0.242187 1.573221
O  2.933831 -1.787179 -0.10738
O  2.644912 -3.279094 1.545169
N  -1.333114 0.945482 0.230547
C  -5.641773 -0.34623 -1.149314
C  -5.377804 -1.416184 -0.08937
C  -4.349769 0.12141 -1.8227
C  -4.490463 -0.890264 1.040739
C  -3.296722 0.317185 -0.795384
C  -3.362385 -0.118289 0.461793
C  -1.990251 0.99605 -1.003418
C  -2.109171 0.257676 1.167466
C  -0.033155 1.421496 0.458056
C  0.959401 0.556647 0.904611
C  0.283534 2.749017 0.23349
C  2.252803 1.003459 1.125316
C  0.555414 -1.975043 -2.036615
C  1.570243 3.212613 0.418443
C  1.33614 -3.126505 -1.41148
C  2.546723 2.344958 0.86752
C  -0.938837 -2.254942 -2.17338
C  2.788064 -2.802228 -1.111723
C  -1.273029 -3.47374 -3.022531
C  2.996822 -1.008538 2.134783
C  2.83245 -2.159507 1.155836
H  -6.333674 -0.725719 -1.9026
H  -6.134124 0.51146 -0.681803
H  -6.320931 -1.781046 0.319902
H  -4.889586 -2.275866 -0.558097
H  -4.003666 -0.616399 -2.554601
H  -4.508731 1.043663 -2.385814
H  -5.062865 -0.248119 1.717666
H  -4.111653 -1.707528 1.658413
H  0.689161 -0.476179 1.069828
H  0.972094 -1.750164 -3.023988
H  0.691204 -1.065488 -1.445882
H  1.345088 -3.981895 -2.093211
H  0.842984 -3.480449 -0.501895
H  1.801981 4.251894 0.232329
H  -1.378672 -2.374097 -1.177253
H  -1.412805 -1.374119 -2.61298
H  3.328324 -3.7004 -0.808333
H  3.28007 -2.388082 -1.99206
H  -2.350316 -3.576456 -3.156688
H  -0.825967 -3.396813 -4.015396
H  -0.916983 -4.400282 -2.571239
H  2.117891 -0.991601 2.7906
H  3.8523 -1.249056 2.768982
totalener: -1805.18473686 hartree
nucrepener: 3116.76128090 hartree
electener: -4921.94601776 hartree
oneelecener: -8671.06396561 hartree
twoeener: 3749.11794785 hartree
kineticenergy: 1799.01256063 hartree
xcener: -147.731711181187 hartree
chargesum: -0.0000000
charge: -0.053688 -0.192470 -0.300210 -0.309320 -0.279361 -0.247355 -0.358363 -0.040249 -0.136634 -0.131504 -0.061773 -0.077166 -0.094875 -0.074631 0.206773 0.246776 0.043685 -0.221664 0.193965 0.315754 -0.113498 -0.113390 -0.153474 -0.024283 -0.113168 -0.010441 -0.264384 -0.017020 0.316290 0.080569 0.077397 0.080983 0.073029 0.088340 0.098779 0.094163 0.094471 0.115224 0.075920 0.084430 0.076608 0.092538 0.114106 0.051795 0.065154 0.110045 0.102456 0.081740 0.083110 0.080934 0.119807 0.124076
qa: -0.0537 -0.1925 -0.3002 -0.3093 -0.2794 -0.2474 -0.3584 -0.0402 -0.1366 -0.1315 -0.0618 -0.0772 -0.0949 -0.0746 0.2068 0.2468 0.0437 -0.2217 0.1940 0.3158 -0.1135 -0.1134 -0.1535 -0.0243 -0.1132 -0.0104 -0.2644 -0.0170 0.3163 0.0806 0.0774 0.0810 0.0730 0.0883 0.0988 0.0942 0.0945 0.1152 0.0759 0.0844 0.0766 0.0925 0.1141 0.0518 0.0652 0.1100 0.1025 0.0817 0.0831 0.0809 0.1198 0.1241
va: 1.2582 1.1108 2.1986 2.2033 2.1239 2.1617 2.1490 3.0219 3.9018 3.8933 3.9148 3.9250 3.6287 3.5879 4.2191 4.2394 3.6947 3.9564 4.1512 3.9072 3.8449 3.9776 3.8362 3.9312 3.8711 3.9067 3.9510 3.9463 4.1474 1.0117 1.0090 1.0122 1.0112 1.0117 1.0203 1.0078 1.0200 1.0233 1.0144 1.0194 1.0161 1.0194 1.0227 1.0079 1.0180 1.0111 0.9963 1.0076 1.0012 0.9990 1.0038 1.0005
dispcorr: -0.031082498 hartree
energy: -1805.215819360761
dipole: -32.25512 30.91880 -1.33632 -41.59843 40.77415 -0.82428 -21.66156 20.99354 -0.66803
magnitude: 1.70630 au
magnitude: 4.33707 debye
