program: Orca
programVersion: 5.0.2
elementType: Cl F O O O O O N C C C C C C C C C C C C C C C C C C C C C H H H H H H H H H H H H H H H H H H H H H H H
charge: 0
multiplicity: 1
keywords: wb97x-d3
keywords: def2-TZVPP
keywords: def2/J RIJCOSX
keywords: DEFGRID2
keywords: scfconv7
keywords: smallprint printgap noloewdin
keywords: NOSOSCF
formula: C21H23ClFNO5
InChI: InChI=1/C21H23ClFNO5/c1-2-3-6-9-28-19(25)12-29-18-11-17(16(23)10-15(18)22)24-20(26)13-7-4-5-8-14(13)21(24)27/h10-11H,2-9,12H2,1H3
52 atoms
Cl 4.033664 2.559641 1.701318
F  -0.834613 3.353254 0.736964
O  -1.841085 -0.612776 2.432482
O  -1.722041 1.661657 -1.511731
O  3.224879 -0.17775 1.598509
O  3.053154 -1.777365 -0.515542
O  2.479487 -3.561108 0.72121
N  -1.424523 0.672808 0.555138
C  -5.84599 -0.89749 0.29074
C  -5.520304 -0.812559 -1.201126
C  -4.604889 -1.208331 1.129563
C  -4.521999 0.306253 -1.506156
C  -3.466987 -0.382209 0.654921
C  -3.434706 0.287411 -0.49664
C  -2.18369 -0.166428 1.374784
C  -2.127958 0.985884 -0.610417
C  -0.126072 1.119081 0.837624
C  0.899066 0.20644 1.053305
C  0.150443 2.471999 0.900715
C  2.186918 0.634233 1.337579
C  1.028396 -1.337811 -2.848683
C  1.431874 2.923852 1.142917
C  1.585822 -2.643136 -2.294127
C  2.44229 2.007998 1.366594
C  -0.373836 -1.504253 -3.426835
C  2.989303 -2.54375 -1.727666
C  -0.822326 -0.311636 -4.259198
C  2.98228 -1.531833 1.843519
C  2.795085 -2.408042 0.615295
H  -6.273536 0.05321 0.621873
H  -6.608785 -1.657556 0.465484
H  -5.101934 -1.766706 -1.534126
H  -6.434474 -0.658087 -1.775855
H  -4.789949 -1.028738 2.190872
H  -4.338178 -2.267489 1.051462
H  -4.106931 0.20387 -2.511562
H  -5.014509 1.28383 -1.487822
H  0.654867 -0.844874 0.998627
H  1.699741 -0.972255 -3.633507
H  1.01783 -0.561346 -2.078041
H  1.628177 -3.378963 -3.103739
H  0.91364 -3.071209 -1.545566
H  1.634849 3.985024 1.179184
H  -0.405644 -2.407019 -4.045098
H  -1.082793 -1.677539 -2.610972
H  3.40407 -3.537725 -1.553642
H  3.645828 -2.016407 -2.420433
H  -0.802007 0.611563 -3.682521
H  -0.173625 -0.176192 -5.126016
H  -1.838817 -0.445565 -4.630934
H  2.128987 -1.689404 2.512681
H  3.863888 -1.907442 2.367815
totalener: -1805.18565459 hartree
nucrepener: 3093.28129609 hartree
electener: -4898.46695068 hartree
oneelecener: -8624.28051490 hartree
twoeener: 3725.81356422 hartree
kineticenergy: 1799.02216936 hartree
xcener: -147.730128637513 hartree
chargesum: 0.0000000
charge: -0.052966 -0.193694 -0.307997 -0.322176 -0.278022 -0.244597 -0.357120 -0.054231 -0.136942 -0.133828 -0.075196 -0.075730 -0.082360 -0.062985 0.244658 0.234291 0.038592 -0.215760 0.192291 0.327293 -0.107592 -0.113232 -0.137526 -0.021182 -0.093057 -0.003120 -0.275356 -0.018742 0.309840 0.076905 0.080713 0.075557 0.080065 0.095712 0.093747 0.092012 0.096670 0.112117 0.057082 0.072240 0.069731 0.082727 0.114993 0.061512 0.046894 0.107748 0.100578 0.102935 0.078367 0.075337 0.122268 0.120536
qa: -0.0530 -0.1937 -0.3080 -0.3222 -0.2780 -0.2446 -0.3571 -0.0542 -0.1369 -0.1338 -0.0752 -0.0757 -0.0824 -0.0630 0.2447 0.2343 0.0386 -0.2158 0.1923 0.3273 -0.1076 -0.1132 -0.1375 -0.0212 -0.0931 -0.0031 -0.2754 -0.0187 0.3098 0.0769 0.0807 0.0756 0.0801 0.0957 0.0937 0.0920 0.0967 0.1121 0.0571 0.0722 0.0697 0.0827 0.1150 0.0615 0.0469 0.1077 0.1006 0.1029 0.0784 0.0753 0.1223 0.1205
va: 1.2588 1.1095 2.2066 2.1722 2.1260 2.1642 2.1497 3.0418 3.9005 3.8969 3.9221 3.9274 3.6387 3.6443 4.2475 4.2096 3.6899 3.9587 4.1529 3.8772 3.8423 3.9760 3.8585 3.9358 3.8758 3.8858 3.9468 3.9533 4.1443 1.0084 1.0116 1.0092 1.0121 1.0185 1.0085 1.0175 1.0084 1.0306 1.0139 1.0162 1.0189 1.0233 1.0222 1.0086 1.0067 1.0134 0.9974 1.0074 1.0059 1.0059 1.0046 0.9971
dispcorr: -0.029240216 hartree
energy: -1805.214894806971
dipole: -28.82176 27.61303 -1.20873 -29.53655 28.91095 -0.62560 -32.54885 31.82302 -0.72583
magnitude: 1.54247 au
magnitude: 3.92066 debye
