program: Orca
programVersion: 5.0.2
elementType: Cl F O O O O O N C C C C C C C C C C C C C C C C C C C C C H H H H H H H H H H H H H H H H H H H H H H H
charge: 0
multiplicity: 1
keywords: wb97x-d3
keywords: def2-TZVPP
keywords: def2/J RIJCOSX
keywords: DEFGRID2
keywords: scfconv7
keywords: smallprint printgap noloewdin
keywords: NOSOSCF
formula: C21H23ClFNO5
InChI: InChI=1/C21H23ClFNO5/c1-2-3-6-9-28-19(25)12-29-18-11-17(16(23)10-15(18)22)24-20(26)13-7-4-5-8-14(13)21(24)27/h10-11H,2-9,12H2,1H3
52 atoms
Cl 4.223876 2.895995 0.648106
F  -0.770258 3.412644 0.851958
O  -1.277312 0.827704 -2.701227
O  -1.9251 0.795872 1.806906
O  3.547485 0.517752 -0.784042
O  2.920643 -1.707381 0.494908
O  2.735876 -2.907719 -1.398962
N  -1.253069 1.002411 -0.395682
C  -5.529057 -0.460191 -1.688238
C  -5.419811 -1.161701 -0.334123
C  -4.162954 -0.292482 -2.357143
C  -4.572914 -0.358173 0.654862
C  -3.172175 0.162952 -1.350006
C  -3.358201 0.147078 -0.03072
C  -1.813239 0.695091 -1.638152
C  -2.140808 0.680934 0.634718
C  0.050761 1.477252 -0.190089
C  1.142675 0.737353 -0.626294
C  0.267987 2.670727 0.471467
C  2.439102 1.166475 -0.389497
C  0.042853 -2.81273 0.767367
C  1.548637 3.109918 0.740605
C  1.115003 -2.661708 1.840935
C  2.62722 2.359303 0.313818
C  -1.378567 -2.826185 1.327351
C  2.543002 -2.796708 1.348181
C  -1.72127 -4.076232 2.126771
C  3.421373 -0.639784 -1.556139
C  2.974717 -1.890027 -0.810773
H  -6.196184 -1.017481 -2.347237
H  -5.983277 0.524942 -1.548233
H  -6.413321 -1.332362 0.082841
H  -4.968237 -2.148639 -0.473684
H  -3.825221 -1.237092 -2.795813
H  -4.21466 0.415882 -3.187031
H  -5.141074 0.486471 1.057623
H  -4.292238 -0.965201 1.518781
H  0.94377 -0.183987 -1.154665
H  0.219212 -3.725514 0.190172
H  0.124735 -1.986267 0.056932
H  0.988509 -3.434491 2.60524
H  0.991673 -1.703667 2.354324
H  1.702014 4.038957 1.271562
H  -1.531806 -1.940599 1.949815
H  -2.08135 -2.7356 0.493458
H  3.234708 -2.748525 2.189567
H  2.691923 -3.748141 0.835379
H  -2.756486 -4.053064 2.467816
H  -1.593417 -4.97822 1.525934
H  -1.096505 -4.181001 3.01439
H  4.415871 -0.842522 -1.958783
H  2.758817 -0.499507 -2.417793
totalener: -1805.18434140 hartree
nucrepener: 3124.51278248 hartree
electener: -4929.69712388 hartree
oneelecener: -8686.64354197 hartree
twoeener: 3756.94641809 hartree
kineticenergy: 1799.01774086 hartree
xcener: -147.732482924406 hartree
chargesum: -0.0000000
charge: -0.053476 -0.193817 -0.305546 -0.305597 -0.278203 -0.243886 -0.351894 -0.051934 -0.136238 -0.131872 -0.070509 -0.085734 -0.062580 -0.095503 0.243926 0.208934 0.050956 -0.206529 0.189946 0.310741 -0.088098 -0.108760 -0.110543 -0.030786 -0.125295 -0.028938 -0.252539 -0.008584 0.303533 0.080575 0.076601 0.082256 0.074634 0.093077 0.095789 0.102549 0.097325 0.117767 0.089083 0.032306 0.069080 0.084180 0.114249 0.059252 0.062223 0.106884 0.102577 0.083645 0.079716 0.075149 0.121224 0.118683
qa: -0.0535 -0.1938 -0.3055 -0.3056 -0.2782 -0.2439 -0.3519 -0.0519 -0.1362 -0.1319 -0.0705 -0.0857 -0.0626 -0.0955 0.2439 0.2089 0.0510 -0.2065 0.1899 0.3107 -0.0881 -0.1088 -0.1105 -0.0308 -0.1253 -0.0289 -0.2525 -0.0086 0.3035 0.0806 0.0766 0.0823 0.0746 0.0931 0.0958 0.1025 0.0973 0.1178 0.0891 0.0323 0.0691 0.0842 0.1142 0.0593 0.0622 0.1069 0.1026 0.0836 0.0797 0.0751 0.1212 0.1187
va: 1.2582 1.1092 2.2096 2.1961 2.1336 2.1532 2.1555 3.0173 3.8974 3.8908 3.9205 3.9181 3.5997 3.6065 4.2410 4.2210 3.6813 3.9871 4.1508 3.9040 3.8717 3.9764 3.8344 3.9393 3.9070 3.9134 3.9459 3.9378 4.1514 1.0117 1.0088 1.0123 1.0105 1.0096 1.0177 1.0093 1.0145 1.0187 1.0196 1.0257 1.0195 1.0151 1.0227 1.0173 1.0015 0.9975 1.0158 1.0064 1.0023 1.0031 0.9965 1.0038
dispcorr: -0.031241616 hartree
energy: -1805.215583019798
dipole: -34.91616 33.61765 -1.29851 -43.74979 42.86244 -0.88735 4.17383 -4.00205 0.17179
magnitude: 1.58209 au
magnitude: 4.02136 debye
