program: Gaussian 09
title: 000056527
version: EM64L-G09RevD.01
frameworkgroup: C1[X(C12H12F3NO)]
method: RPBEPBE
basis: SDD
operation: Freq
keyword: #p
keyword: freq=noraman
keyword: PBEPBE/SDD
title: #p freq=noraman PBEPBE/SDD
converged: NO YES NO NO
title: Mulliken charges:
elementType: F F F O N C C C C C C C C C C C C H H H H H H H H H H H H
charge: -0.162694 -0.168634 -0.164957 -0.304595 -0.144816 0.513433 0.290478 -0.470087 -0.388546 -0.364007 -0.282029 -0.216608 0.240247 -0.293281 0.230920 -0.638042 -0.654556 0.252597 0.248355 0.268505 0.273571 0.240951 0.223000 0.227951 0.288521 0.227471 0.242680 0.242771 0.241400
chargesum: 0.00000
title: Mulliken charges with hydrogens summed into heavy atoms:
elementType: F F F O N C C C C C C C C C C C C
charge: -0.162694 -0.168634 -0.164957 -0.304595 -0.144816 0.513433 0.290478 -0.217489 -0.140191 -0.095502 -0.008458 0.024343 0.240247 -0.070281 0.230920 0.105901 0.072295
polarizability: 2.43710404e+02 -2.92928024e+01 1.58760774e+02 3.19951251e-01 -1.09057701e-01 7.26753062e+01
1716.lowfreq: -16.8657 -2.9708 -0.0002 0.0004 0.0005 2.4794 5.5432 22.7083 49.4513
frequency: -16.0120 22.6632 49.4350 52.9998 84.7749 99.9534 120.1702 135.1578 139.9711 168.8048 213.7724 249.2124 265.3549 277.6154 300.9262 320.9994 351.0147 376.5350 415.2826 426.3762 475.6835 501.4509 533.5581 566.2552 603.1927 608.9724 620.5693 678.9547 699.1805 704.6266 811.2356 817.1203 881.4595 901.0359 909.1030 934.8733 975.0997 985.3359 987.4158 993.9696 1010.0197 1016.9702 1054.6761 1060.6089 1089.5170 1105.2994 1131.7881 1133.9226 1189.1352 1195.6099 1245.7251 1258.2338 1301.3007 1307.6675 1323.7494 1379.9944 1391.4198 1413.6411 1443.2338 1444.2558 1474.9085 1478.8238 1482.9809 1493.9613 1496.0866 1559.3405 1590.9560 1615.7336 1652.8140 2966.2691 2972.2695 3044.5361 3049.8575 3101.2034 3103.4563 3117.7313 3136.4950 3142.4079 3154.1303 3157.4847 3177.5562
redmass: 15.3593 4.0708 4.6506 3.3136 1.4080 3.1028 2.4892 2.7501 5.8467 1.3774 8.5807 4.4300 2.4722 3.7769 6.2063 8.4960 6.0878 5.3042 2.9483 4.6754 4.6461 8.7228 5.1136 6.5666 5.4115 11.1926 4.8967 4.0399 8.0258 2.2954 1.5245 6.2026 1.8471 4.3842 1.6960 1.4104 2.9245 7.0777 5.8660 1.4238 5.8358 1.2196 1.4816 2.9504 1.2267 1.9211 1.8917 1.3982 1.0911 1.8083 5.0078 1.6439 1.7619 2.4233 1.3627 2.8781 5.9814 1.2036 1.2308 3.1078 1.6506 1.3994 1.0723 1.0534 1.1298 6.4512 5.9207 6.0598 5.7482 1.0354 1.0372 1.1019 1.1016 1.0975 1.0896 1.0972 1.0886 1.0908 1.0914 1.0923 1.0982
irintensity: 0.0308 6.3129 2.3149 1.0291 0.6492 1.7211 0.0099 0.1093 0.4371 0.0990 1.1402 0.7752 2.0708 4.1629 1.3282 5.9248 2.7687 19.0234 2.2442 0.7364 6.7289 3.9060 3.9672 20.4697 3.5339 14.8320 1.4983 12.9107 2.3794 14.2533 72.1915 9.6894 9.9889 35.6619 22.4329 11.9480 13.3457 182.8321 18.5936 26.6824 108.3813 43.7725 18.2190 130.1504 0.3469 26.3586 152.0811 15.7905 1.0658 94.8556 22.4590 104.1168 30.1699 108.9488 21.0318 131.5785 28.0001 59.0363 16.6301 4.0473 16.6709 16.1105 24.4287 12.0419 75.1982 178.6161 12.6638 2.3759 58.8278 55.8400 76.0385 36.9747 33.0765 22.7611 0.1688 1.5603 3.8179 17.9316 5.9095 7.9014 6.3321
temp: 298.150 k
press: 1.00000 atm
elementType: 9 9 9 8 7 6 6 6 6 6 6 6 6 6 6 6 6 1 1 1 1 1 1 1 1 1 1 1 1
symmnumber: 1
zpe: 566586.6 jmol-1
zpe.correction: 0.215801 hartree
zpe.thermalcorrener: 0.231917 hartree
zpe.thermalcorrenthalpy: 0.232861 hartree
zpe.thermalcorrgfe: 0.170515 hartree
zpe.sumelectzpe: -892.730618 hartree
zpe.sumelectthermal: -892.714503 hartree
zpe.sumelectthermalent: -892.713558 hartree
zpe.sumelectthermalfe: -892.775904 hartree
dipole: 1.3863 -0.7597 -0.1668
dipole: 1.5896
quadrupole: -99.6014 -92.5386 -103.0946
quadrupole: -29.1591 0.1669 0.1091
quadrupole: -1.1899 5.8729 -4.6830 -29.1591 0.1669 0.1091
hfenergy: -892.9464194 hartree
pointgroup: C01 [X(C12H12F3N1O1)]
dipole: -0.5426833 -0.3049128 0.0603761 debye
polarizability: 243.0322162|30.220044|159.4174333|1.9379256|0.4418669|72.6968347 unknown
InChI: InChI=1S/C12H12F3NO/c1-16(2)11(17)7-6-9-4-3-5-10(8-9)12(13,14)15/h3-8H,1-2H3
charge 0 multiplicity 1
29 atoms
F  4.695683 -0.991719 0.420345
F  2.811484 -2.199959 0.81094
F  3.4537 -1.757853 -1.312351
O  -3.952581 1.377462 -0.105412
N  -4.202301 -0.94424 -0.068718
C  0.342554 1.15843 -0.029341
C  2.550907 0.081662 0.010356
C  1.144932 -0.015139 -0.013852
C  1.002456 2.421543 -0.023373
C  3.196654 1.341819 0.016639
C  -1.128127 1.130844 -0.048759
C  2.408838 2.512189 0.001047
C  3.364351 -1.181932 -0.010753
C  -1.939121 0.031968 -0.049148
C  -3.42357 0.214312 -0.074912
C  -5.669316 -0.809255 -0.120285
C  -3.647673 -2.311669 -0.026922
H  0.675993 -1.004316 -0.010632
H  0.397039 3.33546 -0.034459
H  4.288509 1.400839 0.041759
H  -1.643435 2.102366 -0.065483
H  2.893838 3.493292 0.009079
H  -1.523834 -0.981265 -0.037545
H  -6.077022 -1.299558 -1.02504
H  -5.911363 0.263885 -0.148187
H  -6.137184 -1.265449 0.772978
H  -2.999545 -2.468977 0.854786
H  -3.074902 -2.558668 -0.941473
H  -4.483465 -3.025572 0.045716
