program: Orca
programVersion: 5.0.2
elementType: Cl F O O O O O N C C C C C C C C C C C C C C C C C C C C C H H H H H H H H H H H H H H H H H H H H H H H
charge: 0
multiplicity: 1
keywords: wb97x-d3
keywords: def2-TZVPP
keywords: def2/J RIJCOSX
keywords: DEFGRID2
keywords: scfconv7
keywords: smallprint printgap noloewdin
keywords: NOSOSCF
formula: C21H23ClFNO5
InChI: InChI=1/C21H23ClFNO5/c1-2-3-6-9-28-19(25)12-29-18-11-17(16(23)10-15(18)22)24-20(26)13-7-4-5-8-14(13)21(24)27/h10-11H,2-9,12H2,1H3
52 atoms
Cl 3.91443 1.198285 -2.198818
F  -0.900933 2.515311 -1.631662
O  -2.193908 -1.670272 -2.068615
O  -1.832812 1.603959 1.07845
O  2.939541 -1.338683 -1.327502
O  2.795253 -1.476036 1.283024
O  2.285085 -3.660552 1.307549
N  -1.650106 0.064846 -0.639705
C  -6.186033 -0.986563 0.017202
C  -5.82364 -0.522244 1.428178
C  -4.991029 -1.616913 -0.701697
C  -4.739926 0.557246 1.408396
C  -3.778189 -0.795346 -0.46241
C  -3.671781 0.16407 0.455982
C  -2.487684 -0.907689 -1.193134
C  -2.305817 0.746622 0.388731
C  -0.32968 0.316503 -1.040875
C  0.636841 -0.679503 -0.964533
C  0.027471 1.567635 -1.508387
C  1.948792 -0.431669 -1.340306
C  1.357562 0.8222 2.509459
C  1.332854 1.850184 -1.855004
C  2.611472 0.127343 3.030185
C  2.287237 0.854253 -1.770172
C  1.303228 2.313152 2.826239
C  2.663052 -1.349233 2.704664
C  2.327968 3.137072 2.057476
C  2.71084 -2.606426 -0.786515
C  2.564369 -2.64772 0.728134
H  -7.01078 -1.699607 0.056265
H  -6.543258 -0.130998 -0.563166
H  -6.710729 -0.147259 1.940273
H  -5.467176 -1.377233 2.00996
H  -4.813761 -2.635623 -0.341782
H  -5.180491 -1.712022 -1.773162
H  -5.1579 1.522592 1.104142
H  -4.32071 0.717308 2.404475
H  0.331971 -1.650468 -0.60003
H  0.478393 0.332521 2.939978
H  1.276405 0.69056 1.427763
H  2.655386 0.221799 4.119913
H  3.515389 0.60836 2.64743
H  1.60042 2.838412 -2.202218
H  0.303045 2.676975 2.585404
H  1.434908 2.466701 3.902388
H  3.516543 -1.835586 3.183684
H  1.758281 -1.861186 3.041956
H  2.223435 4.199966 2.276207
H  3.354077 2.857737 2.300296
H  2.199799 3.007675 0.981056
H  3.584618 -3.205819 -1.049404
H  1.845158 -3.109256 -1.232804
totalener: -1805.18602278 hartree
nucrepener: 3118.28342267 hartree
electener: -4923.46944545 hartree
oneelecener: -8674.45265260 hartree
twoeener: 3750.98320715 hartree
kineticenergy: 1799.01837839 hartree
xcener: -147.731916923424 hartree
chargesum: 0.0000000
charge: -0.051257 -0.194745 -0.307556 -0.327727 -0.278298 -0.242371 -0.353476 -0.060440 -0.136383 -0.135217 -0.075605 -0.078081 -0.103402 -0.044315 0.252311 0.250378 -0.020209 -0.132654 0.243615 0.284224 -0.029842 -0.187003 -0.112190 0.026540 -0.111683 -0.020090 -0.250732 -0.008414 0.304568 0.080853 0.076705 0.080681 0.075922 0.093814 0.095451 0.094356 0.093937 0.102578 0.068138 -0.015581 0.063324 0.070293 0.117133 0.083398 0.049773 0.106287 0.094323 0.086017 0.069589 0.074210 0.122870 0.115979
qa: -0.0513 -0.1947 -0.3076 -0.3277 -0.2783 -0.2424 -0.3535 -0.0604 -0.1364 -0.1352 -0.0756 -0.0781 -0.1034 -0.0443 0.2523 0.2504 -0.0202 -0.1327 0.2436 0.2842 -0.0298 -0.1870 -0.1122 0.0265 -0.1117 -0.0201 -0.2507 -0.0084 0.3046 0.0809 0.0767 0.0807 0.0759 0.0938 0.0955 0.0944 0.0939 0.1026 0.0681 -0.0156 0.0633 0.0703 0.1171 0.0834 0.0498 0.1063 0.0943 0.0860 0.0696 0.0742 0.1229 0.1160
va: 1.2600 1.1086 2.2090 2.1799 2.1328 2.1501 2.1586 3.0358 3.8984 3.8981 3.9254 3.9237 3.6669 3.6562 4.2461 4.2216 3.7050 3.9150 4.0842 3.8526 3.8646 3.9693 3.9131 3.8751 3.9097 3.8860 3.9439 3.9502 4.1459 1.0115 1.0087 1.0119 1.0089 1.0084 1.0183 1.0081 1.0195 1.0346 1.0163 1.0603 1.0154 1.0155 1.0244 1.0160 1.0095 1.0027 1.0087 1.0073 1.0029 0.9986 0.9978 1.0015
dispcorr: -0.030462798 hartree
energy: -1805.216485578833
dipole: -18.40298 17.07618 -1.32680 -0.89477 0.82291 -0.07186 32.41007 -31.69813 0.71194
magnitude: 1.50745 au
magnitude: 3.83164 debye
