program: Orca
programVersion: 5.0.2
elementType: Cl F O O O O O N C C C C C C C C C C C C C C C C C C C C C H H H H H H H H H H H H H H H H H H H H H H H
charge: 0
multiplicity: 1
keywords: wb97x-d3
keywords: def2-TZVPP
keywords: def2/J RIJCOSX
keywords: DEFGRID2
keywords: scfconv7
keywords: smallprint printgap noloewdin
keywords: NOSOSCF
formula: C21H23ClFNO5
InChI: InChI=1/C21H23ClFNO5/c1-2-3-6-9-28-19(25)12-29-18-11-17(16(23)10-15(18)22)24-20(26)13-7-4-5-8-14(13)21(24)27/h10-11H,2-9,12H2,1H3
52 atoms
Cl 4.053372 1.066074 1.74019
F  -0.579287 -0.217843 3.201872
O  -2.637923 1.982496 2.266492
O  -1.580617 -1.178924 -0.838764
O  2.70467 1.749934 -0.679022
O  2.112905 -0.385104 -2.081376
O  1.368085 0.776678 -3.849243
N  -1.723687 0.459925 0.785613
C  -6.397622 -0.05362 0.697499
C  -6.069665 -0.458138 -0.739854
C  -5.399237 0.967148 1.247187
C  -4.694085 -1.119861 -0.847171
C  -4.020582 0.569155 0.86962
C  -3.71113 -0.351033 -0.043019
C  -2.764022 1.129045 1.437629
C  -2.230979 -0.462644 -0.12998
C  -0.355508 0.651822 1.033181
C  0.466706 1.164352 0.038872
C  0.197649 0.294711 2.248721
C  1.833393 1.291546 0.235544
C  3.247747 -2.802916 -0.962135
C  1.549034 0.443345 2.483723
C  1.835216 -2.68167 -1.531131
C  2.361882 0.928267 1.476366
C  4.342387 -3.069062 -1.992629
C  1.670802 -1.639886 -2.615889
C  4.138081 -4.346337 -2.796488
C  2.272263 1.964894 -1.991771
C  1.859457 0.713839 -2.756835
H  -7.408095 0.354192 0.750612
H  -6.38932 -0.943298 1.333809
H  -6.835245 -1.134831 -1.122235
H  -6.09321 0.428762 -1.379687
H  -5.607159 1.966608 0.851564
H  -5.483824 1.056791 2.332431
H  -4.730922 -2.152197 -0.484401
H  -4.367396 -1.183877 -1.887453
H  0.003107 1.445636 -0.8968
H  3.247329 -3.613985 -0.227758
H  3.494384 -1.896606 -0.404137
H  1.131898 -2.461358 -0.724738
H  1.512377 -3.636358 -1.955571
H  1.968076 0.160769 3.43925
H  4.434523 -2.216305 -2.67133
H  5.299547 -3.12502 -1.468463
H  2.258247 -1.876647 -3.506617
H  0.624644 -1.562819 -2.917506
H  4.99004 -4.544624 -3.446714
H  4.017952 -5.210423 -2.14061
H  3.25411 -4.297135 -3.433796
H  3.117807 2.415188 -2.514613
H  1.450151 2.68752 -2.051872
totalener: -1805.18500594 hartree
nucrepener: 3066.76596235 hartree
electener: -4871.95096828 hartree
oneelecener: -8571.46869133 hartree
twoeener: 3699.51772304 hartree
kineticenergy: 1799.02371774 hartree
xcener: -147.732275828253 hartree
chargesum: 0.0000000
charge: -0.057318 -0.196215 -0.299616 -0.338628 -0.279839 -0.243720 -0.351927 -0.090404 -0.136299 -0.135843 -0.077295 -0.077686 -0.104804 -0.042180 0.277700 0.237270 0.034427 -0.166162 0.186358 0.306562 -0.107633 -0.117264 -0.148108 -0.007327 -0.123310 -0.025079 -0.250788 -0.008221 0.304080 0.080497 0.076801 0.080253 0.076576 0.094416 0.095675 0.093813 0.093851 0.100117 0.072293 0.073959 0.085486 0.075054 0.114911 0.059267 0.070619 0.107310 0.122663 0.088960 0.078601 0.066512 0.120439 0.111197
qa: -0.0573 -0.1962 -0.2996 -0.3386 -0.2798 -0.2437 -0.3519 -0.0904 -0.1363 -0.1358 -0.0773 -0.0777 -0.1048 -0.0422 0.2777 0.2373 0.0344 -0.1662 0.1864 0.3066 -0.1076 -0.1173 -0.1481 -0.0073 -0.1233 -0.0251 -0.2508 -0.0082 0.3041 0.0805 0.0768 0.0803 0.0766 0.0944 0.0957 0.0938 0.0939 0.1001 0.0723 0.0740 0.0855 0.0751 0.1149 0.0593 0.0706 0.1073 0.1227 0.0890 0.0786 0.0665 0.1204 0.1112
va: 1.2510 1.1045 2.2184 2.1730 2.1288 2.1311 2.1612 3.0237 3.8981 3.8986 3.9232 3.9223 3.6800 3.6442 4.2397 4.2249 3.6777 3.9710 4.1664 3.8582 3.8689 3.9836 3.9216 3.8951 3.9012 3.8253 3.9311 3.9503 4.1481 1.0117 1.0083 1.0118 1.0085 1.0080 1.0192 1.0079 1.0197 1.0336 1.0087 1.0217 1.0273 1.0107 1.0225 1.0052 1.0092 0.9999 1.0139 1.0078 1.0032 1.0027 0.9981 1.0016
dispcorr: -0.028849415 hartree
energy: -1805.213855350673
dipole: -11.31901 10.00160 -1.31742 -27.57296 27.01731 -0.55564 -27.02120 26.74933 -0.27187
magnitude: 1.45542 au
magnitude: 3.69938 debye
