program: Orca
programVersion: 5.0.2
elementType: Cl F O O O O O N C C C C C C C C C C C C C C C C C C C C C H H H H H H H H H H H H H H H H H H H H H H H
charge: 0
multiplicity: 1
keywords: wb97x-d3
keywords: def2-TZVPP
keywords: def2/J RIJCOSX
keywords: DEFGRID2
keywords: scfconv7
keywords: smallprint printgap noloewdin
keywords: NOSOSCF
formula: C21H23ClFNO5
InChI: InChI=1/C21H23ClFNO5/c1-2-3-6-9-28-19(25)12-29-18-11-17(16(23)10-15(18)22)24-20(26)13-7-4-5-8-14(13)21(24)27/h10-11H,2-9,12H2,1H3
52 atoms
Cl 3.929702 0.575009 -2.331874
F  -0.87566 2.01693 -2.042762
O  -2.249078 -2.010858 -1.801821
O  -1.764642 1.598917 0.931978
O  2.96187 -1.66623 -0.84963
O  3.093351 -1.08887 1.749141
O  1.695638 -2.785036 2.231111
N  -1.63496 -0.16014 -0.560654
C  -6.226206 -0.90063 0.116501
C  -5.870428 -0.270862 1.463549
C  -5.050804 -1.678735 -0.478934
C  -4.726892 0.737465 1.337571
C  -3.803693 -0.889574 -0.322089
C  -3.664185 0.173822 0.468534
C  -2.513457 -1.146709 -1.016379
C  -2.271211 0.679896 0.353495
C  -0.310048 -0.000876 -0.994077
C  0.653547 -0.952254 -0.683652
C  0.048354 1.107963 -1.735747
C  1.967717 -0.797338 -1.102445
C  2.588694 1.857317 1.692056
C  1.350198 1.293258 -2.155165
C  1.914716 0.842874 2.610409
C  2.301671 0.342888 -1.839306
C  1.674043 3.000532 1.264238
C  2.788509 -0.351517 2.942176
C  1.184322 3.871028 2.413266
C  2.723613 -2.692874 0.072834
C  2.426049 -2.196429 1.483262
H  -7.087582 -1.560736 0.226945
H  -6.526089 -0.114018 -0.58173
H  -6.746911 0.217043 1.892256
H  -5.579165 -1.057675 2.16528
H  -4.931191 -2.645312 0.021314
H  -5.22374 -1.911375 -1.53196
H  -5.083829 1.678508 0.906305
H  -4.319015 0.998062 2.316673
H  0.33926 -1.811277 -0.106999
H  2.959999 1.351705 0.79787
H  3.471762 2.265798 2.196803
H  0.972945 0.500802 2.169183
H  1.646245 1.313859 3.560455
H  1.619614 2.173105 -2.722407
H  2.212657 3.622819 0.544595
H  0.812201 2.594015 0.730536
H  3.751682 -0.028808 3.340617
H  2.313622 -1.001371 3.677467
H  2.017953 4.275217 2.991553
H  0.600632 4.714094 2.043519
H  0.541124 3.316953 3.097491
H  3.637631 -3.290079 0.097087
H  1.911648 -3.357734 -0.237905
totalener: -1805.18483934 hartree
nucrepener: 3134.45877805 hartree
electener: -4939.64361740 hartree
oneelecener: -8706.89524972 hartree
twoeener: 3767.25163232 hartree
kineticenergy: 1799.02591532 hartree
xcener: -147.732870594497 hartree
chargesum: 0.0000000
charge: -0.052586 -0.197006 -0.305298 -0.330876 -0.273649 -0.244038 -0.347094 -0.065270 -0.136476 -0.134421 -0.077083 -0.076274 -0.102166 -0.040165 0.258884 0.249262 0.020528 -0.163646 0.168879 0.274539 -0.140922 -0.105153 -0.125489 -0.004373 -0.094014 -0.014510 -0.265921 0.005540 0.288133 0.080607 0.076267 0.079860 0.075640 0.093507 0.095006 0.093630 0.094146 0.113608 0.091886 0.070555 0.073933 0.078247 0.113583 0.071036 0.052482 0.096231 0.113051 0.076207 0.085678 0.077891 0.114912 0.112704
qa: -0.0526 -0.1970 -0.3053 -0.3309 -0.2736 -0.2440 -0.3471 -0.0653 -0.1365 -0.1344 -0.0771 -0.0763 -0.1022 -0.0402 0.2589 0.2493 0.0205 -0.1636 0.1689 0.2745 -0.1409 -0.1052 -0.1255 -0.0044 -0.0940 -0.0145 -0.2659 0.0055 0.2881 0.0806 0.0763 0.0799 0.0756 0.0935 0.0950 0.0936 0.0941 0.1136 0.0919 0.0706 0.0739 0.0782 0.1136 0.0710 0.0525 0.0962 0.1131 0.0762 0.0857 0.0779 0.1149 0.1127
va: 1.2565 1.0996 2.2126 2.1791 2.1315 2.1514 2.1549 3.0010 3.8993 3.8981 3.9260 3.9222 3.6636 3.6586 4.2449 4.2177 3.6789 3.9457 4.1193 3.8457 3.8669 3.9451 3.8744 3.8744 3.8792 3.8842 3.9531 3.9118 4.1727 1.0116 1.0086 1.0117 1.0088 1.0080 1.0186 1.0080 1.0193 1.0409 1.0109 1.0122 1.0225 1.0183 1.0247 1.0071 1.0280 0.9971 1.0202 1.0013 1.0080 1.0016 0.9930 1.0028
dispcorr: -0.031499390 hartree
energy: -1805.216338734384
dipole: -19.56249 18.47315 -1.08934 8.85108 -8.85912 -0.00804 30.69488 -30.05683 0.63806
magnitude: 1.26247 au
magnitude: 3.20895 debye
