program: Orca
programVersion: 5.0.2
elementType: Cl F O O O O O N C C C C C C C C C C C C C C C C C C C C C H H H H H H H H H H H H H H H H H H H H H H H
charge: 0
multiplicity: 1
keywords: wb97x-d3
keywords: def2-TZVPP
keywords: def2/J RIJCOSX
keywords: DEFGRID2
keywords: scfconv7
keywords: smallprint printgap noloewdin
keywords: NOSOSCF
formula: C21H23ClFNO5
InChI: InChI=1/C21H23ClFNO5/c1-2-3-6-9-28-19(25)12-29-18-11-17(16(23)10-15(18)22)24-20(26)13-7-4-5-8-14(13)21(24)27/h10-11H,2-9,12H2,1H3
52 atoms
Cl 3.786044 2.892402 2.590564
F  -1.230873 2.64106 2.366196
O  -2.13621 2.686087 -0.587531
O  -0.968725 -1.454353 0.914684
O  3.604758 0.922199 0.525098
O  2.6180 -2.108383 -0.926299
O  3.243741 -1.77517 1.202625
N  -1.226447 0.772552 0.338868
C  -5.140386 -0.442392 -1.949221
C  -5.148014 -1.522861 -0.867058
C  -4.514075 0.859635 -1.446406
C  -3.731941 -1.893688 -0.42266
C  -3.270307 0.5502 -0.698041
C  -2.924034 -0.659457 -0.26058
C  -2.197547 1.517522 -0.338807
C  -1.603121 -0.568343 0.41379
C  -0.034294 1.295136 0.864335
C  1.190435 0.855759 0.379634
C  -0.060304 2.230753 1.880067
C  2.381555 1.317286 0.919133
C  0.198967 -2.964924 -2.358037
C  1.110705 2.739593 2.405685
C  1.30518 -3.8768 -1.841137
C  2.324364 2.28014 1.930354
C  -0.530286 -3.535106 -3.567789
C  1.997816 -3.360438 -0.59854
C  -1.591271 -2.588766 -4.109991
C  3.691687 -0.078792 -0.446236
C  3.162695 -1.415283 0.066965
H  -4.574657 -0.801365 -2.814493
H  -6.15609 -0.253529 -2.299274
H  -5.712024 -1.162394 -0.00204
H  -5.667192 -2.412162 -1.226903
H  -4.302003 1.541754 -2.27263
H  -5.206966 1.396507 -0.790187
H  -3.746306 -2.463649 0.509019
H  -3.250577 -2.546226 -1.159355
H  1.175515 0.136019 -0.426353
H  0.618183 -1.990049 -2.623094
H  -0.519462 -2.781236 -1.552587
H  2.0432 -4.057524 -2.628595
H  0.884642 -4.855318 -1.589575
H  1.075729 3.477417 3.194892
H  0.193323 -3.757991 -4.357404
H  -0.989374 -4.491858 -3.302147
H  1.283309 -3.207278 0.213598
H  2.757016 -4.06451 -0.249635
H  -1.15017 -1.644116 -4.431382
H  -2.113104 -3.017403 -4.965558
H  -2.341482 -2.354649 -3.351496
H  4.755498 -0.189315 -0.66642
H  3.194489 0.206157 -1.379616
totalener: -1805.18529283 hartree
nucrepener: 3082.42832991 hartree
electener: -4887.61362275 hartree
oneelecener: -8602.57967217 hartree
twoeener: 3714.96604942 hartree
kineticenergy: 1799.01674890 hartree
xcener: -147.727397585103 hartree
chargesum: -0.0000000
charge: -0.050835 -0.195621 -0.299526 -0.323043 -0.273275 -0.274874 -0.316707 -0.087109 -0.145754 -0.120685 -0.072539 -0.101120 -0.088537 -0.078852 0.277940 0.236051 0.008961 -0.125580 0.188556 0.316411 -0.074333 -0.115442 -0.107441 -0.025492 -0.105038 -0.022175 -0.220504 0.033736 0.282597 0.076649 0.083377 0.079378 0.080208 0.094159 0.095071 0.103319 0.093795 0.082157 0.064749 0.022441 0.066603 0.062558 0.113625 0.058809 0.059307 0.113255 0.111515 0.079470 0.091205 0.030441 0.112914 0.105222
qa: -0.0508 -0.1956 -0.2995 -0.3230 -0.2733 -0.2749 -0.3167 -0.0871 -0.1458 -0.1207 -0.0725 -0.1011 -0.0885 -0.0789 0.2779 0.2361 0.0090 -0.1256 0.1886 0.3164 -0.0743 -0.1154 -0.1074 -0.0255 -0.1050 -0.0222 -0.2205 0.0337 0.2826 0.0766 0.0834 0.0794 0.0802 0.0942 0.0951 0.1033 0.0938 0.0822 0.0647 0.0224 0.0666 0.0626 0.1136 0.0588 0.0593 0.1133 0.1115 0.0795 0.0912 0.0304 0.1129 0.1052
va: 1.2605 1.1064 2.2188 2.1762 2.1483 2.1130 2.1853 3.0488 3.9003 3.8844 3.9168 3.9332 3.6631 3.6230 4.2390 4.2115 3.7337 3.9870 4.1530 3.8793 3.8405 3.9775 3.9306 3.9513 3.9140 3.8779 3.9454 3.9177 4.1534 1.0098 1.0129 1.0097 1.0127 1.0199 1.0070 1.0211 1.0034 1.0486 1.0151 1.0371 1.0177 1.0165 1.0228 1.0088 1.0044 1.0039 1.0053 1.0052 1.0087 1.0085 0.9933 1.0057
dispcorr: -0.029546199 hartree
energy: -1805.214839032015
dipole: -30.19511 28.88718 -1.30793 -42.52926 41.22870 -1.30056 -41.48406 39.70427 -1.77980
magnitude: 2.56317 au
magnitude: 6.51505 debye
