program: Orca
programVersion: 5.0.2
elementType: Cl F O O O O O N C C C C C C C C C C C C C C C C C C C C C H H H H H H H H H H H H H H H H H H H H H H H
charge: 0
multiplicity: 1
keywords: wb97x-d3
keywords: def2-TZVPP
keywords: def2/J RIJCOSX
keywords: DEFGRID2
keywords: scfconv7
keywords: smallprint printgap noloewdin
keywords: NOSOSCF
formula: C21H23ClFNO5
InChI: InChI=1/C21H23ClFNO5/c1-2-3-6-9-28-19(25)12-29-18-11-17(16(23)10-15(18)22)24-20(26)13-7-4-5-8-14(13)21(24)27/h10-11H,2-9,12H2,1H3
52 atoms
Cl 3.821481 -0.340571 -2.357419
F  -1.011497 1.003035 -2.639317
O  -2.827856 -1.416256 -2.22104
O  -1.402975 0.53152 1.644187
O  2.899787 -1.791734 -0.071731
O  2.642919 -0.073093 1.904168
O  1.943929 -1.630538 3.359046
N  -1.739267 -0.452463 -0.422618
C  -6.279666 -0.911145 0.700325
C  -5.944191 0.329603 1.527816
C  -5.439118 -0.988233 -0.576143
C  -4.486364 0.328722 1.991879
C  -4.027415 -0.654537 -0.261744
C  -3.608888 -0.087001 0.868786
C  -2.851995 -0.910241 -1.137401
C  -2.130952 0.065713 0.812588
C  -0.420485 -0.457566 -0.901841
C  0.564169 -1.181037 -0.242522
C  -0.079018 0.28187 -2.019113
C  1.883014 -1.149829 -0.671995
C  1.710273 2.473054 0.754637
C  1.217204 0.298867 -2.491436
C  2.543754 2.298744 2.019798
C  2.193764 -0.406392 -1.813045
C  2.002694 3.762914 -0.005097
C  2.25645 1.011133 2.760729
C  3.396552 3.811872 -0.618375
C  2.700407 -2.324887 1.20645
C  2.374521 -1.302309 2.288872
H  -6.101842 -1.806762 1.302422
H  -7.340139 -0.91639 0.444727
H  -6.128613 1.224376 0.926448
H  -6.606333 0.395509 2.392222
H  -5.502276 -1.978366 -1.032613
H  -5.814708 -0.290647 -1.331733
H  -4.189239 1.312653 2.361301
H  -4.346668 -0.356938 2.833881
H  0.268304 -1.756855 0.62384
H  0.651256 2.43783 1.023459
H  1.878352 1.627816 0.08358
H  2.337591 3.122854 2.710098
H  3.612277 2.350524 1.795134
H  1.468905 0.881901 -3.366292
H  1.26203 3.86882 -0.801894
H  1.857545 4.624444 0.654444
H  2.819471 0.955458 3.695216
H  1.193991 0.920535 2.9983
H  3.52985 4.70675 -1.226555
H  4.180643 3.820024 0.139255
H  3.572575 2.94574 -1.259781
H  3.637531 -2.817006 1.473693
H  1.925307 -3.098736 1.225216
totalener: -1805.18603510 hartree
nucrepener: 3125.98512135 hartree
electener: -4931.17115645 hartree
oneelecener: -8689.95883273 hartree
twoeener: 3758.78767628 hartree
kineticenergy: 1799.02054170 hartree
xcener: -147.732731557328 hartree
chargesum: -0.0000000
charge: -0.053484 -0.196516 -0.299302 -0.338886 -0.281324 -0.242497 -0.348073 -0.079852 -0.135552 -0.136122 -0.080153 -0.073425 -0.105882 -0.036536 0.279590 0.229776 0.014674 -0.155722 0.216473 0.272161 -0.034113 -0.147900 -0.118533 0.037796 -0.114396 -0.018609 -0.243778 0.002214 0.293490 0.075850 0.080829 0.076626 0.081156 0.095140 0.094648 0.093379 0.094401 0.105664 0.076403 -0.013456 0.062270 0.068025 0.112852 0.068173 0.055391 0.108719 0.106663 0.084648 0.070810 0.068777 0.117827 0.109683
qa: -0.0535 -0.1965 -0.2993 -0.3389 -0.2813 -0.2425 -0.3481 -0.0799 -0.1356 -0.1361 -0.0802 -0.0734 -0.1059 -0.0365 0.2796 0.2298 0.0147 -0.1557 0.2165 0.2722 -0.0341 -0.1479 -0.1185 0.0378 -0.1144 -0.0186 -0.2438 0.0022 0.2935 0.0759 0.0808 0.0766 0.0812 0.0951 0.0946 0.0934 0.0944 0.1057 0.0764 -0.0135 0.0623 0.0680 0.1129 0.0682 0.0554 0.1087 0.1067 0.0846 0.0708 0.0688 0.1178 0.1097
va: 1.2560 1.1038 2.2187 2.1666 2.1321 2.1476 2.1628 3.0296 3.8977 3.8979 3.9248 3.9210 3.6807 3.6443 4.2364 4.2266 3.6962 3.9432 4.1089 3.8855 3.8548 3.9656 3.9367 3.8496 3.9128 3.8739 3.9347 3.9388 4.1662 1.0087 1.0118 1.0086 1.0116 1.0189 1.0079 1.0192 1.0086 1.0345 1.0242 1.0568 1.0154 1.0154 1.0247 1.0076 1.0093 1.0034 1.0086 1.0068 1.0030 1.0079 0.9953 1.0019
dispcorr: -0.030994835 hartree
energy: -1805.217029935826
dipole: -14.47040 13.18241 -1.28799 20.06026 -19.74226 0.31799 22.13981 -21.53571 0.60409
magnitude: 1.45772 au
magnitude: 3.70524 debye
