program: Orca
programVersion: 5.0.2
elementType: Cl F O O O O O N C C C C C C C C C C C C C C C C C C C C C H H H H H H H H H H H H H H H H H H H H H H H
charge: 0
multiplicity: 1
keywords: wb97x-d3
keywords: def2-TZVPP
keywords: def2/J RIJCOSX
keywords: DEFGRID2
keywords: scfconv7
keywords: smallprint printgap noloewdin
keywords: NOSOSCF
formula: C21H23ClFNO5
InChI: InChI=1/C21H23ClFNO5/c1-2-3-6-9-28-19(25)12-29-18-11-17(16(23)10-15(18)22)24-20(26)13-7-4-5-8-14(13)21(24)27/h10-11H,2-9,12H2,1H3
52 atoms
Cl 4.146835 2.768806 1.164949
F  -0.633358 3.365363 -0.273467
O  -1.307088 0.759314 -1.874367
O  -2.128804 0.600783 2.600615
O  3.204597 0.189148 1.935699
O  2.965932 -1.616448 0.01932
O  2.148678 -3.175012 1.415032
N  -1.359239 0.824802 0.432423
C  -5.413143 -1.022199 -1.059865
C  -5.897498 -0.37294 0.23705
C  -4.245671 -0.254279 -1.683552
C  -4.802269 -0.341894 1.30534
C  -3.280786 0.127394 -0.622505
C  -3.520075 0.079681 0.687697
C  -1.890368 0.604609 -0.839039
C  -2.299614 0.520148 1.418193
C  -0.056719 1.295805 0.65763
C  0.902638 0.476695 1.237361
C  0.292372 2.572796 0.264125
C  2.207986 0.91628 1.403047
C  0.802172 -2.852588 -2.831822
C  1.583161 3.036248 0.415926
C  1.151826 -2.134263 -1.53391
C  2.534125 2.208525 0.981757
C  -0.653176 -2.65642 -3.240382
C  2.600169 -2.368124 -1.145166
C  -0.992686 -3.356385 -4.548094
C  2.944916 -1.125953 2.331376
C  2.630535 -2.096937 1.201144
H  -5.097961 -2.049181 -0.853302
H  -6.234372 -1.08884 -1.774802
H  -6.223811 0.650123 0.028345
H  -6.770431 -0.904225 0.618881
H  -3.747111 -0.849742 -2.452351
H  -4.600056 0.648542 -2.191705
H  -5.06834 0.331217 2.123409
H  -4.676582 -1.32842 1.763285
H  0.592781 -0.513686 1.541449
H  1.0079 -3.923779 -2.729286
H  1.452867 -2.494292 -3.637041
H  0.493364 -2.491294 -0.736952
H  0.970549 -1.061877 -1.645278
H  1.844863 4.035252 0.096474
H  -1.303644 -3.0315 -2.443426
H  -0.86407 -1.587149 -3.325579
H  2.798745 -3.430337 -0.987926
H  3.269905 -2.008293 -1.926133
H  -0.38205 -2.977174 -5.369159
H  -0.819584 -4.431855 -4.480795
H  -2.037302 -3.208198 -4.822974
H  2.13432 -1.189456 3.065884
H  3.851166 -1.473282 2.831723
totalener: -1805.18658488 hartree
nucrepener: 3084.87477954 hartree
electener: -4890.06136443 hartree
oneelecener: -8607.42862165 hartree
twoeener: 3717.36725722 hartree
kineticenergy: 1799.02045957 hartree
xcener: -147.730272936201 hartree
chargesum: -0.0000000
charge: -0.051846 -0.196555 -0.325695 -0.304389 -0.278452 -0.245858 -0.352438 -0.056690 -0.134019 -0.136165 -0.076564 -0.077069 -0.042688 -0.102216 0.226862 0.256721 0.031202 -0.206673 0.192200 0.326187 -0.117233 -0.112155 -0.117407 -0.017507 -0.086800 0.008027 -0.255981 -0.002258 0.291779 0.075510 0.080399 0.076926 0.080380 0.090124 0.097164 0.095321 0.093357 0.107022 0.062609 0.058359 0.074522 0.075763 0.114377 0.048519 0.064333 0.098028 0.104911 0.075526 0.073773 0.080753 0.119000 0.117004
qa: -0.0518 -0.1966 -0.3257 -0.3044 -0.2785 -0.2459 -0.3524 -0.0567 -0.1340 -0.1362 -0.0766 -0.0771 -0.0427 -0.1022 0.2269 0.2567 0.0312 -0.2067 0.1922 0.3262 -0.1172 -0.1122 -0.1174 -0.0175 -0.0868 0.0080 -0.2560 -0.0023 0.2918 0.0755 0.0804 0.0769 0.0804 0.0901 0.0972 0.0953 0.0934 0.1070 0.0626 0.0584 0.0745 0.0758 0.1144 0.0485 0.0643 0.0980 0.1049 0.0755 0.0738 0.0808 0.1190 0.1170
va: 1.2598 1.1056 2.1727 2.2123 2.1348 2.1667 2.1506 3.0159 3.8978 3.9010 3.9273 3.9248 3.6535 3.6605 4.2096 4.2473 3.6631 3.9893 4.1665 3.8563 3.9268 3.9794 3.8306 3.9484 3.8805 3.8836 3.9647 3.9238 4.1634 1.0090 1.0118 1.0084 1.0118 1.0165 1.0084 1.0184 1.0083 1.0353 1.0095 1.0111 1.0186 1.0225 1.0230 1.0049 1.0175 1.0128 0.9992 1.0031 1.0025 1.0063 1.0030 0.9954
dispcorr: -0.029063044 hartree
energy: -1805.215647926881
dipole: -31.56438 30.34598 -1.21841 -39.41018 38.76660 -0.64358 -27.58674 26.95667 -0.63007
magnitude: 1.51515 au
magnitude: 3.85121 debye
