program: Orca
programVersion: 5.0.2
elementType: Cl F O O O O O N C C C C C C C C C C C C C C C C C C C C C H H H H H H H H H H H H H H H H H H H H H H H
charge: 0
multiplicity: 1
keywords: wb97x-d3
keywords: def2-TZVPP
keywords: def2/J RIJCOSX
keywords: DEFGRID2
keywords: scfconv7
keywords: smallprint printgap noloewdin
keywords: NOSOSCF
formula: C21H23ClFNO5
InChI: InChI=1/C21H23ClFNO5/c1-2-3-6-9-28-19(25)12-29-18-11-17(16(23)10-15(18)22)24-20(26)13-7-4-5-8-14(13)21(24)27/h10-11H,2-9,12H2,1H3
52 atoms
Cl 4.026754 2.701224 1.114193
F  -0.745417 3.176131 -0.393231
O  -1.464623 0.520672 -1.843681
O  -2.216168 0.616921 2.647769
O  3.096787 0.157458 2.019361
O  3.081787 -1.511172 -0.037489
O  2.019096 -3.101052 1.141982
N  -1.466306 0.684683 0.462424
C  -5.841786 -0.305488 -0.93083
C  -5.854239 -0.996173 0.433595
C  -4.447487 -0.313812 -1.560369
C  -4.941742 -0.290891 1.439731
C  -3.438828 0.040346 -0.530713
C  -3.657426 0.059514 0.783537
C  -2.029959 0.43562 -0.790525
C  -2.408122 0.480896 1.473849
C  -0.162105 1.166016 0.656325
C  0.798398 0.389833 1.291512
C  0.181647 2.422093 0.19586
C  2.099347 0.849299 1.441326
C  0.95456 -1.973235 -3.142242
C  1.466536 2.906117 0.333881
C  1.351076 -1.532203 -1.737775
C  2.419019 2.119321 0.952872
C  0.67109 -3.465073 -3.282125
C  2.69805 -2.077261 -1.299057
C  0.138754 -3.825035 -4.661514
C  2.896024 -1.200579 2.291701
C  2.602348 -2.055365 1.064748
H  -6.553092 -0.788052 -1.602472
H  -6.177136 0.729287 -0.81574
H  -6.871746 -1.037804 0.824621
H  -5.525165 -2.032756 0.31574
H  -4.213349 -1.300275 -1.973808
H  -4.388935 0.380301 -2.4017
H  -5.413201 0.621163 1.820159
H  -4.761964 -0.917146 2.3165
H  0.496998 -0.584697 1.651005
H  1.729831 -1.678306 -3.858171
H  0.060349 -1.412236 -3.424922
H  0.578337 -1.850026 -1.032085
H  1.379942 -0.441309 -1.697803
H  1.721596 3.888239 -0.038823
H  1.574699 -4.04811 -3.082898
H  -0.052562 -3.766097 -2.518575
H  2.701608 -3.166324 -1.238746
H  3.480876 -1.770169 -1.993087
H  -0.066294 -4.892174 -4.747615
H  -0.788631 -3.291784 -4.877204
H  0.854035 -3.563094 -5.442905
H  2.098053 -1.369639 3.022284
H  3.823639 -1.554392 2.746709
totalener: -1805.18441069 hartree
nucrepener: 3084.97128521 hartree
electener: -4890.15569590 hartree
oneelecener: -8607.77862703 hartree
twoeener: 3717.62293113 hartree
kineticenergy: 1799.02445791 hartree
xcener: -147.731446913707 hartree
chargesum: 0.0000000
charge: -0.050552 -0.197330 -0.325926 -0.304511 -0.279344 -0.250788 -0.349224 -0.053626 -0.135743 -0.136061 -0.078401 -0.076586 -0.042988 -0.105381 0.233339 0.259229 0.005176 -0.187641 0.207398 0.290305 -0.124822 -0.125520 -0.135204 0.004777 -0.075129 0.018734 -0.259559 0.009700 0.286125 0.080716 0.077142 0.080396 0.076464 0.092268 0.095364 0.093900 0.094447 0.113655 0.059514 0.080613 0.062337 0.089418 0.115140 0.047634 0.059235 0.099355 0.102611 0.084961 0.073383 0.073108 0.113824 0.114072
qa: -0.0506 -0.1973 -0.3259 -0.3045 -0.2793 -0.2508 -0.3492 -0.0536 -0.1357 -0.1361 -0.0784 -0.0766 -0.0430 -0.1054 0.2333 0.2592 0.0052 -0.1876 0.2074 0.2903 -0.1248 -0.1255 -0.1352 0.0048 -0.0751 0.0187 -0.2596 0.0097 0.2861 0.0807 0.0771 0.0804 0.0765 0.0923 0.0954 0.0939 0.0944 0.1137 0.0595 0.0806 0.0623 0.0894 0.1151 0.0476 0.0592 0.0994 0.1026 0.0850 0.0734 0.0731 0.1138 0.1141
va: 1.2610 1.1048 2.1763 2.2135 2.1347 2.1606 2.1522 3.0006 3.8996 3.8986 3.9217 3.9268 3.6464 3.6684 4.2143 4.2461 3.6681 3.9491 4.1458 3.8650 3.9135 3.9927 3.8799 3.9440 3.8616 3.8599 3.9555 3.9119 4.1714 1.0115 1.0086 1.0118 1.0082 1.0077 1.0193 1.0081 1.0192 1.0385 1.0116 1.0176 1.0200 1.0205 1.0235 1.0117 1.0065 1.0141 0.9997 1.0051 1.0047 1.0030 1.0021 0.9941
dispcorr: -0.029186177 hartree
energy: -1805.213596869206
dipole: -26.62283 25.42714 -1.19569 -38.02073 37.46841 -0.55232 -27.66500 27.11603 -0.54897
magnitude: 1.42692 au
magnitude: 3.62693 debye
