program: Orca
programVersion: 5.0.2
elementType: Cl F O O O O O N C C C C C C C C C C C C C C C C C C C C C H H H H H H H H H H H H H H H H H H H H H H H
charge: 0
multiplicity: 1
keywords: wb97x-d3
keywords: def2-TZVPP
keywords: def2/J RIJCOSX
keywords: DEFGRID2
keywords: scfconv7
keywords: smallprint printgap noloewdin
keywords: NOSOSCF
formula: C21H23ClFNO5
InChI: InChI=1/C21H23ClFNO5/c1-2-3-6-9-28-19(25)12-29-18-11-17(16(23)10-15(18)22)24-20(26)13-7-4-5-8-14(13)21(24)27/h10-11H,2-9,12H2,1H3
52 atoms
Cl 4.045296 2.318669 0.578143
F  -0.676854 2.550265 -1.128552
O  -1.61289 -0.32175 -1.742786
O  -2.247825 1.069148 2.547187
O  2.965932 0.190532 2.166048
O  3.267221 -1.740667 0.386735
O  1.934389 -3.118316 1.56267
N  -1.547206 0.475894 0.424398
C  -6.025696 -0.433086 -0.65479
C  -6.074324 -0.727865 0.84462
C  -4.654165 -0.753224 -1.253174
C  -5.072804 0.12465 1.627125
C  -3.591971 -0.236651 -0.354412
C  -3.776587 0.159103 0.90442
C  -2.159517 -0.059195 -0.709489
C  -2.479236 0.637657 1.454701
C  -0.212315 0.906357 0.474045
C  0.703628 0.30006 1.322567
C  0.203064 1.956311 -0.323802
C  2.02261 0.729721 1.371773
C  1.881938 -2.425562 -3.054584
C  1.509031 2.400061 -0.299351
C  1.977033 -1.794326 -1.669545
C  2.414007 1.786454 0.546959
C  0.77247 -1.840803 -3.924642
C  3.076242 -2.441439 -0.848005
C  0.932937 -0.35519 -4.216783
C  2.772172 -1.128612 2.598057
C  2.591079 -2.120724 1.455038
H  -6.797685 -1.001928 -1.174746
H  -6.25299 0.623604 -0.822888
H  -7.081406 -0.557954 1.228045
H  -5.853748 -1.786144 1.010966
H  -4.528501 -1.833003 -1.383118
H  -4.547572 -0.320956 -2.250618
H  -5.44479 1.146967 1.749067
H  -4.932867 -0.260348 2.639657
H  0.354055 -0.515448 1.940913
H  1.719715 -3.502974 -2.950945
H  2.841345 -2.313056 -3.571713
H  1.016694 -1.888339 -1.154762
H  2.183196 -0.724566 -1.753597
H  1.817361 3.218313 -0.934896
H  0.747681 -2.393372 -4.867435
H  -0.193993 -2.008594 -3.444829
H  2.869112 -3.497024 -0.662446
H  4.03393 -2.36821 -1.364628
H  0.826765 0.248289 -3.316137
H  1.908593 -0.138844 -4.65635
H  0.172092 -0.01297 -4.917955
H  1.925195 -1.23093 3.283464
H  3.670074 -1.396105 3.159396
totalener: -1805.18424830 hartree
nucrepener: 3113.53812463 hartree
electener: -4918.72237293 hartree
oneelecener: -8665.11819268 hartree
twoeener: 3746.39581975 hartree
kineticenergy: 1799.02374547 hartree
xcener: -147.730710626112 hartree
chargesum: 0.0000000
charge: -0.048992 -0.198505 -0.338365 -0.304355 -0.283176 -0.245752 -0.347294 -0.074487 -0.134360 -0.136930 -0.078547 -0.077101 -0.039752 -0.104501 0.261039 0.258848 0.021689 -0.119269 0.185714 0.210471 -0.141120 -0.134439 -0.099423 0.043466 -0.099843 0.003556 -0.249090 0.013293 0.285825 0.080150 0.076804 0.080905 0.076083 0.093420 0.094247 0.094517 0.094403 0.115270 0.071261 0.060231 0.074162 0.060584 0.115579 0.070314 0.061132 0.100255 0.099469 0.068624 0.078262 0.084097 0.108067 0.113568
qa: -0.0490 -0.1985 -0.3384 -0.3044 -0.2832 -0.2458 -0.3473 -0.0745 -0.1344 -0.1369 -0.0785 -0.0771 -0.0398 -0.1045 0.2610 0.2588 0.0217 -0.1193 0.1857 0.2105 -0.1411 -0.1344 -0.0994 0.0435 -0.0998 0.0036 -0.2491 0.0133 0.2858 0.0802 0.0768 0.0809 0.0761 0.0934 0.0942 0.0945 0.0944 0.1153 0.0713 0.0602 0.0742 0.0606 0.1156 0.0703 0.0611 0.1003 0.0995 0.0686 0.0783 0.0841 0.1081 0.1136
va: 1.2617 1.0976 2.1696 2.2136 2.1271 2.1532 2.1524 3.0182 3.8986 3.8995 3.9210 3.9253 3.6562 3.6695 4.2025 4.2441 3.6673 3.9258 4.1209 3.9181 3.9430 3.9984 3.8489 3.9038 3.8898 3.8788 3.9379 3.9098 4.1834 1.0117 1.0085 1.0115 1.0085 1.0081 1.0197 1.0082 1.0189 1.0321 1.0114 1.0093 1.0214 1.0136 1.0246 1.0077 1.0210 1.0176 0.9988 1.0043 1.0024 1.0086 1.0009 0.9942
dispcorr: -0.030187293 hartree
energy: -1805.214435595356
dipole: -23.07092 21.85562 -1.21530 -26.10500 25.64015 -0.46485 -22.49912 22.18204 -0.31708
magnitude: 1.33925 au
magnitude: 3.40409 debye
