program: Orca
programVersion: 5.0.2
elementType: Cl F O O O O O N C C C C C C C C C C C C C C C C C C C C C H H H H H H H H H H H H H H H H H H H H H H H
charge: 0
multiplicity: 1
keywords: wb97x-d3
keywords: def2-TZVPP
keywords: def2/J RIJCOSX
keywords: DEFGRID2
keywords: scfconv7
keywords: smallprint printgap noloewdin
keywords: NOSOSCF
formula: C21H23ClFNO5
InChI: InChI=1/C21H23ClFNO5/c1-2-3-6-9-28-19(25)12-29-18-11-17(16(23)10-15(18)22)24-20(26)13-7-4-5-8-14(13)21(24)27/h10-11H,2-9,12H2,1H3
52 atoms
Cl 3.818293 2.637131 2.494904
F  -1.066225 3.26449 1.502704
O  -1.76975 -0.984887 1.966158
O  -1.67533 2.177967 -1.310829
O  3.322685 0.033859 1.456185
O  3.350886 -2.639896 -0.888153
O  3.275265 -0.416545 -1.244626
N  -1.376643 0.738265 0.475021
C  -5.735742 -0.864573 -0.267982
C  -5.383967 -0.412764 -1.685676
C  -4.49967 -1.317336 0.512306
C  -4.429993 0.783151 -1.683066
C  -3.387968 -0.362519 0.278897
C  -3.360735 0.562882 -0.67835
C  -2.117725 -0.295678 1.04929
C  -2.072094 1.301828 -0.599306
C  -0.132161 1.185937 0.945786
C  0.976761 0.35032 0.920359
C  -0.001631 2.464402 1.454888
C  2.204078 0.778913 1.40307
C  0.73856 -2.565977 -2.323689
C  1.212203 2.923897 1.921651
C  1.895191 -3.511019 -2.626251
C  2.306316 2.080515 1.900634
C  -0.592412 -3.076054 -2.86202
C  3.265326 -2.958472 -2.28279
C  -1.762968 -2.198601 -2.446415
C  3.30334 -1.281546 1.000473
C  3.306621 -1.362858 -0.516718
H  -6.213517 -0.037903 0.265592
H  -6.466777 -1.67367 -0.302868
H  -4.916152 -1.242779 -2.223687
H  -6.292046 -0.160514 -2.235186
H  -4.714973 -1.398922 1.579973
H  -4.186897 -2.318355 0.196272
H  -3.993166 0.942879 -2.671415
H  -4.965924 1.707573 -1.444102
H  0.846883 -0.638747 0.505096
H  0.944521 -1.574102 -2.737219
H  0.649139 -2.433183 -1.240054
H  1.908733 -3.745728 -3.695508
H  1.737741 -4.462142 -2.109469
H  1.299976 3.928398 2.311071
H  -0.542629 -3.134286 -3.953144
H  -0.761386 -4.098819 -2.511865
H  4.037386 -3.706364 -2.467089
H  3.492874 -2.077977 -2.884446
H  -1.880774 -2.19223 -1.361643
H  -1.620086 -1.164738 -2.766767
H  -2.701959 -2.550825 -2.875021
H  2.460435 -1.857871 1.403153
H  4.211199 -1.751904 1.383735
totalener: -1805.18504760 hartree
nucrepener: 3080.11534201 hartree
electener: -4885.30038961 hartree
oneelecener: -8598.17673398 hartree
twoeener: 3712.87634438 hartree
kineticenergy: 1799.02329103 hartree
xcener: -147.732112460001 hartree
chargesum: -0.0000000
charge: -0.055595 -0.197484 -0.309778 -0.298219 -0.276371 -0.280143 -0.318625 -0.071955 -0.131082 -0.143499 -0.066742 -0.077751 -0.124009 -0.100932 0.238857 0.277278 0.016142 -0.097948 0.192190 0.308784 -0.110573 -0.122987 -0.110531 -0.020081 -0.077927 -0.015516 -0.278629 -0.000951 0.290784 0.076408 0.079380 0.074678 0.084326 0.099097 0.089172 0.096380 0.099901 0.065168 0.093079 0.044044 0.064809 0.069312 0.113112 0.061480 0.055076 0.103729 0.107147 0.069577 0.084035 0.090605 0.117312 0.125470
qa: -0.0556 -0.1975 -0.3098 -0.2982 -0.2764 -0.2801 -0.3186 -0.0720 -0.1311 -0.1435 -0.0667 -0.0778 -0.1240 -0.1009 0.2389 0.2773 0.0161 -0.0979 0.1922 0.3088 -0.1106 -0.1230 -0.1105 -0.0201 -0.0779 -0.0155 -0.2786 -0.0010 0.2908 0.0764 0.0794 0.0747 0.0843 0.0991 0.0892 0.0964 0.0999 0.0652 0.0931 0.0440 0.0648 0.0693 0.1131 0.0615 0.0551 0.1037 0.1071 0.0696 0.0840 0.0906 0.1173 0.1255
va: 1.2562 1.1030 2.2056 2.2173 2.1381 2.1105 2.1712 3.0103 3.8944 3.8970 3.9197 3.9125 3.5889 3.5987 4.2330 4.2169 3.7288 4.0056 4.1494 3.8833 3.8653 3.9954 3.8851 3.9286 3.9307 3.8950 3.9647 3.9003 4.1777 1.0097 1.0122 1.0112 1.0134 1.0194 1.0086 1.0190 1.0081 1.0496 1.0127 1.0188 1.0173 1.0138 1.0230 1.0097 1.0074 0.9999 1.0168 0.9978 0.9992 1.0079 0.9992 1.0045
dispcorr: -0.030303766 hartree
energy: -1805.215351365898
dipole: -30.03348 28.86494 -1.16854 -40.35819 38.38402 -1.97417 -33.37601 32.55358 -0.82243
magnitude: 2.43705 au
magnitude: 6.19448 debye
