program: Orca
programVersion: 5.0.2
elementType: Cl F O O O O O N C C C C C C C C C C C C C C C C C C C C C H H H H H H H H H H H H H H H H H H H H H H H
charge: 0
multiplicity: 1
keywords: wb97x-d3
keywords: def2-TZVPP
keywords: def2/J RIJCOSX
keywords: DEFGRID2
keywords: scfconv7
keywords: smallprint printgap noloewdin
keywords: NOSOSCF
formula: C21H23ClFNO5
InChI: InChI=1/C21H23ClFNO5/c1-2-3-6-9-28-19(25)12-29-18-11-17(16(23)10-15(18)22)24-20(26)13-7-4-5-8-14(13)21(24)27/h10-11H,2-9,12H2,1H3
52 atoms
Cl 3.740343 -2.26237 2.201776
F  -1.065726 -2.956456 0.906944
O  -2.688317 -0.821615 2.707882
O  -1.291764 0.39509 -1.453073
O  3.028359 0.48386 1.950937
O  3.431914 1.273655 -0.546798
O  2.322987 3.19784 -0.196638
N  -1.610642 -0.286441 0.734408
C  -6.224593 0.376353 0.104021
C  -5.681269 1.423861 -0.868383
C  -5.284269 0.157439 1.291532
C  -4.340539 0.999976 -1.472918
C  -3.883148 0.082704 0.807679
C  -3.470584 0.443462 -0.406539
C  -2.7150 -0.408266 1.585586
C  -2.005776 0.205226 -0.50933
C  -0.321401 -0.741359 1.060418
C  0.71207 0.152656 1.31351
C  -0.078539 -2.097555 1.157542
C  1.97706 -0.302101 1.661484
C  2.02537 0.833939 -4.029754
C  1.166042 -2.57742 1.511168
C  2.101532 0.732828 -2.51114
C  2.187047 -1.680813 1.759919
C  0.800628 0.133034 -4.604998
C  3.353434 1.396381 -1.97338
C  0.699279 0.273467 -6.116571
C  2.938597 1.852404 1.678242
C  2.842531 2.190431 0.196365
H  -7.210255 0.673742 0.464682
H  -6.360674 -0.571016 -0.425541
H  -6.403596 1.60836 -1.664765
H  -5.552476 2.373398 -0.340659
H  -5.374337 0.974437 2.014943
H  -5.544336 -0.75107 1.83933
H  -4.486623 0.245076 -2.252256
H  -3.846859 1.840746 -1.965548
H  0.490341 1.208697 1.238965
H  2.929631 0.407486 -4.478836
H  2.010583 1.888653 -4.325424
H  2.088166 -0.317174 -2.205611
H  1.215267 1.194325 -2.071326
H  1.338437 -3.641844 1.587269
H  0.832863 -0.926278 -4.33461
H  -0.099684 0.53265 -4.132033
H  4.248812 0.898446 -2.346836
H  3.400768 2.447188 -2.26617
H  1.575527 -0.144505 -6.615214
H  -0.177834 -0.241878 -6.508284
H  0.623673 1.321077 -6.412856
H  3.857901 2.294329 2.069093
H  2.106787 2.336163 2.199996
totalener: -1805.18640399 hartree
nucrepener: 3042.18468484 hartree
electener: -4847.37108883 hartree
oneelecener: -8522.45228507 hartree
twoeener: 3675.08119625 hartree
kineticenergy: 1799.01834253 hartree
xcener: -147.727498495586 hartree
chargesum: -0.0000000
charge: -0.049254 -0.198536 -0.300783 -0.341288 -0.276859 -0.248026 -0.351917 -0.095106 -0.134733 -0.136378 -0.079251 -0.075485 -0.094025 -0.064921 0.274823 0.269982 0.026644 -0.165004 0.189066 0.293875 -0.136511 -0.125771 -0.094744 0.004540 -0.065437 0.008902 -0.256429 0.004491 0.296959 0.079909 0.076546 0.080351 0.076160 0.093286 0.095854 0.093547 0.092691 0.103815 0.053199 0.061103 0.065602 0.077896 0.115272 0.052022 0.057627 0.102396 0.095209 0.070389 0.083690 0.071824 0.113999 0.108786
qa: -0.0493 -0.1985 -0.3008 -0.3413 -0.2769 -0.2480 -0.3519 -0.0951 -0.1347 -0.1364 -0.0793 -0.0755 -0.0940 -0.0649 0.2748 0.2700 0.0266 -0.1650 0.1891 0.2939 -0.1365 -0.1258 -0.0947 0.0045 -0.0654 0.0089 -0.2564 0.0045 0.2970 0.0799 0.0765 0.0804 0.0762 0.0933 0.0959 0.0935 0.0927 0.1038 0.0532 0.0611 0.0656 0.0779 0.1153 0.0520 0.0576 0.1024 0.0952 0.0704 0.0837 0.0718 0.1140 0.1088
va: 1.2631 1.1010 2.2166 2.1682 2.1318 2.1654 2.1484 3.0188 3.8978 3.8998 3.9235 3.9227 3.6621 3.6484 4.2334 4.2120 3.6817 3.9734 4.1661 3.8480 3.9347 3.9899 3.8524 3.9501 3.8801 3.8726 3.9515 3.9301 4.1626 1.0119 1.0085 1.0116 1.0083 1.0078 1.0190 1.0082 1.0198 1.0408 1.0107 1.0093 1.0157 1.0345 1.0233 1.0091 1.0210 0.9996 1.0165 1.0029 1.0062 1.0031 0.9933 1.0033
dispcorr: -0.027441297 hartree
energy: -1805.213845285012
dipole: -20.69908 19.61509 -1.08399 21.01664 -20.60073 0.41592 -42.30414 41.68455 -0.61959
magnitude: 1.31602 au
magnitude: 3.34506 debye
