program: Orca
programVersion: 5.0.2
elementType: Cl F F F F O O O O O O N N N C C C C C C C C C C C C C C C C C C C C C H H H H H H H H H H H H H H H H
charge: 0
multiplicity: 1
keywords: wb97x-d3
keywords: def2-TZVPP
keywords: def2/J RIJCOSX
keywords: DEFGRID2
keywords: scfconv7
keywords: smallprint printgap noloewdin
keywords: NOSOSCF
formula: C21H16ClF4N3O6
InChI: InChI=1/C21H16ClF4N3O6/c1-3-33-18(31)10-34-19-14(5-4-6-27-19)35-15-8-13(12(23)7-11(15)22)29-17(30)9-16(21(24,25)26)28(2)20(29)32/h4-9H,3,10H2,1-2H3
51 atoms
Cl 4.499126 -1.575067 -1.224107
F  -0.383176 -2.733691 -1.611405
F  -5.577944 0.498536 1.591886
F  -5.951432 -1.584054 1.255784
F  -5.120621 -0.917905 3.13129
O  3.532784 0.113768 0.89644
O  -0.976346 -3.054462 1.516154
O  -1.312471 0.885509 -0.688955
O  2.386492 1.990658 -0.693708
O  -0.050844 2.495572 -3.163572
O  1.33146 0.775335 -2.76982
N  -1.142859 -1.079413 0.433579
N  -2.992535 -2.007383 1.54944
N  2.463735 3.577939 0.970806
C  0.221281 -1.204083 0.053624
C  -3.699366 -0.867816 1.256909
C  -1.665235 -2.111844 1.192247
C  -1.84024 0.047135 0.015876
C  -3.188047 0.126995 0.515182
C  1.201247 -0.482315 0.71027
C  0.573377 -2.048701 -0.982613
C  -3.528342 -3.142077 2.310797
C  2.522959 -0.586081 0.309597
C  -5.10204 -0.720108 1.813487
C  1.886682 -2.199477 -1.370343
C  2.857905 -1.452253 -0.725572
C  3.275643 1.374486 1.369267
C  2.695105 2.358682 0.552914
C  3.641217 1.716069 2.649086
C  3.417103 3.020025 3.084527
C  1.458941 2.764951 -1.420653
C  2.817127 3.904332 2.215857
C  0.923125 1.880847 -2.520029
C  -0.712545 1.8010 -4.239138
C  0.051584 1.904998 -5.536571
H  -3.749056 1.017316 0.280029
H  0.921432 0.170443 1.528288
H  -4.593013 -3.249634 2.154114
H  -3.069556 -4.053956 1.947856
H  -3.316418 -3.037663 3.372042
H  2.143674 -2.868861 -2.180265
H  4.094713 0.978004 3.29798
H  3.693655 3.328246 4.082253
H  0.634729 3.111499 -0.793021
H  1.929682 3.6481 -1.863395
H  2.612654 4.9234 2.518097
H  -1.679792 2.292163 -4.322514
H  -0.888436 0.762231 -3.957802
H  -0.532615 1.43223 -6.326427
H  0.213514 2.944568 -5.820763
H  1.016277 1.400925 -5.49195
elementType: Cl F O N C H
totalener: -2285.31137028 hartree
nucrepener: 4200.06921335 hartree
electener: -6485.38058363 hartree
twoeener: 5016.00787688 hartree
cpcmener: -0.05663861 hartree
kineticenergy: 2277.74775430 hartree
xcener: -184.615737834851 hartree
chargesum: 0.0000000
charge: -0.061791 -0.211303 -0.158236 -0.161399 -0.160943 -0.333268 -0.492462 -0.506186 -0.298952 -0.298782 -0.478359 -0.055611 -0.096291 -0.388457 0.013656 0.017025 0.436253 0.393848 -0.161912 -0.167175 0.216811 -0.186196 0.263479 0.537548 -0.133416 0.007227 0.143631 0.379204 -0.149079 -0.155310 0.000962 -0.011918 0.453519 0.041173 -0.253939 0.140408 0.153773 0.129533 0.115796 0.141645 0.135354 0.157317 0.161393 0.113973 0.143180 0.146161 0.112822 0.090103 0.097853 0.089775 0.087564
qa: -0.0618 -0.2113 -0.1582 -0.1614 -0.1609 -0.3333 -0.4925 -0.5062 -0.2990 -0.2988 -0.4784 -0.0556 -0.0963 -0.3885 0.0137 0.0170 0.4363 0.3938 -0.1619 -0.1672 0.2168 -0.1862 0.2635 0.5375 -0.1334 0.0072 0.1436 0.3792 -0.1491 -0.1553 0.0010 -0.0119 0.4535 0.0412 -0.2539 0.1404 0.1538 0.1295 0.1158 0.1416 0.1354 0.1573 0.1614 0.1140 0.1432 0.1462 0.1128 0.0901 0.0979 0.0898 0.0876
va: 1.2505 1.0814 1.1530 1.1462 1.1502 2.0890 2.0208 2.0145 2.0928 2.1205 2.0048 3.1292 3.3797 3.0089 3.5117 3.9737 4.2012 4.1449 3.9026 3.9787 4.1032 3.8616 3.8179 4.4207 3.9944 3.9073 3.8417 4.0095 3.9646 3.8667 3.8724 4.0410 4.0991 3.8418 3.9302 1.0211 1.0105 1.0090 1.0067 0.9878 1.0155 1.0002 0.9895 1.0201 1.0022 0.9951 0.9946 1.0110 1.0061 1.0038 1.0131
dispcorr: -0.031044736 hartree
energy: -2285.342415016121
dipole: 9.57888 -12.03267 -2.45379 18.59354 -17.86387 0.72967 -13.43454 15.08645 1.65191
magnitude: 3.04669 au
magnitude: 7.74406 debye
