program: Orca
programVersion: 5.0.2
elementType: Cl F F F F O O O O O O N N N C C C C C C C C C C C C C C C C C C C C C H H H H H H H H H H H H H H H H
charge: 0
multiplicity: 1
keywords: wb97x-d3
keywords: def2-TZVPP
keywords: def2/J RIJCOSX
keywords: DEFGRID2
keywords: scfconv7
keywords: smallprint printgap noloewdin
keywords: NOSOSCF
formula: C21H16ClF4N3O6
InChI: InChI=1/C21H16ClF4N3O6/c1-3-33-18(31)10-34-19-14(5-4-6-27-19)35-15-8-13(12(23)7-11(15)22)29-17(30)9-16(21(24,25)26)28(2)20(29)32/h4-9H,3,10H2,1-2H3
51 atoms
Cl 4.951812 -2.216512 0.228165
F  0.184833 -3.803087 0.035216
F  -5.229308 0.46838 -0.401208
F  -5.409816 -0.858306 -2.077136
F  -5.717659 -1.613239 -0.101128
O  3.763746 0.267572 -0.496147
O  -0.899364 -0.792971 1.591398
O  -0.734463 -1.964302 -2.774286
O  2.133462 1.290684 1.528255
O  -0.078254 2.368045 0.516218
O  -0.85777 2.99331 2.519995
N  -0.821942 -1.361915 -0.594092
N  -2.87189 -0.949188 0.480345
N  2.640987 3.439417 0.89202
C  0.580964 -1.55081 -0.461028
C  -3.496322 -1.07329 -0.735766
C  -1.497939 -1.012102 0.560734
C  -1.409232 -1.616802 -1.825099
C  -2.833329 -1.403793 -1.855211
C  1.465547 -0.500834 -0.62845
C  1.055061 -2.803266 -0.117688
C  -3.547992 -0.596711 1.733275
C  2.816863 -0.696932 -0.391859
C  -4.978884 -0.771784 -0.825786
C  2.398003 -3.033199 0.07813
C  3.272463 -1.968261 -0.048489
C  3.507787 1.603198 -0.348031
C  2.752842 2.147789 0.70307
C  4.130645 2.473597 -1.215914
C  4.006997 3.843403 -1.013904
C  1.191516 1.802059 2.444406
C  3.255579 4.275789 0.057142
C  -0.029184 2.452444 1.826691
C  -1.06261 3.139286 -0.204093
C  -2.329547 2.360426 -0.450616
H  -3.327775 -1.506867 -2.807677
H  1.088094 0.466567 -0.93094
H  -3.499588 0.474556 1.917696
H  -4.579296 -0.92054 1.727053
H  -3.064977 -1.119142 2.551748
H  2.752727 -4.019233 0.345745
H  4.720305 2.081305 -2.034618
H  4.486815 4.549391 -1.675989
H  0.862791 0.948748 3.038272
H  1.636893 2.524006 3.132222
H  3.137249 5.331971 0.263261
H  -0.57486 3.389212 -1.144517
H  -1.262847 4.069448 0.327647
H  -3.018965 2.986983 -1.01728
H  -2.136929 1.46735 -1.044952
H  -2.823006 2.081473 0.479205
elementType: Cl F O N C H
totalener: -2285.30793758 hartree
nucrepener: 4300.78289481 hartree
electener: -6586.09083239 hartree
twoeener: 5113.78177426 hartree
cpcmener: -0.05243687 hartree
kineticenergy: 2277.74382459 hartree
xcener: -184.617512538050 hartree
chargesum: 0.0000000
charge: -0.062690 -0.211259 -0.159324 -0.157648 -0.160961 -0.319537 -0.495597 -0.494056 -0.304728 -0.270037 -0.485843 -0.027287 -0.065274 -0.386994 0.025806 -0.036447 0.386638 0.372739 -0.127006 -0.213577 0.203247 -0.189733 0.306484 0.540804 -0.117607 -0.001917 0.159485 0.377071 -0.168636 -0.152444 0.023489 -0.017214 0.399061 0.032042 -0.246465 0.137582 0.155829 0.137994 0.130951 0.120867 0.134469 0.154667 0.162694 0.142374 0.132628 0.146029 0.107703 0.105252 0.111400 0.073732 0.091246
qa: -0.0627 -0.2113 -0.1593 -0.1576 -0.1610 -0.3195 -0.4956 -0.4941 -0.3047 -0.2700 -0.4858 -0.0273 -0.0653 -0.3870 0.0258 -0.0364 0.3866 0.3727 -0.1270 -0.2136 0.2032 -0.1897 0.3065 0.5408 -0.1176 -0.0019 0.1595 0.3771 -0.1686 -0.1524 0.0235 -0.0172 0.3991 0.0320 -0.2465 0.1376 0.1558 0.1380 0.1310 0.1209 0.1345 0.1547 0.1627 0.1424 0.1326 0.1460 0.1077 0.1053 0.1114 0.0737 0.0912
va: 1.2514 1.0831 1.1430 1.1547 1.1485 2.1106 2.0023 2.0111 2.0873 2.1060 2.0171 3.1014 3.3510 2.9730 3.4882 3.9917 4.2105 4.1842 3.8598 4.0260 4.1569 3.8655 3.8272 4.4061 3.9921 3.8938 3.8278 3.9672 3.9708 3.8601 3.8379 4.0331 4.0874 3.8408 3.9236 1.0209 1.0219 0.9862 1.0125 1.0061 1.0169 1.0027 0.9890 1.0035 1.0219 0.9950 0.9967 1.0123 1.0099 1.0077 1.0091
dispcorr: -0.035320196 hartree
energy: -2285.343257775712
dipole: 2.88573 -4.15090 -1.26517 29.79027 -28.59013 1.20014 5.27817 -6.02378 -0.74561
magnitude: 1.89656 au
magnitude: 4.82066 debye
