program: Orca
programVersion: 5.0.2
elementType: Cl F F F F O O O O O O N N N C C C C C C C C C C C C C C C C C C C C C H H H H H H H H H H H H H H H H
charge: 0
multiplicity: 1
keywords: wb97x-d3
keywords: def2-TZVPP
keywords: def2/J RIJCOSX
keywords: DEFGRID2
keywords: scfconv7
keywords: smallprint printgap noloewdin
keywords: NOSOSCF
formula: C21H16ClF4N3O6
InChI: InChI=1/C21H16ClF4N3O6/c1-3-33-18(31)10-34-19-14(5-4-6-27-19)35-15-8-13(12(23)7-11(15)22)29-17(30)9-16(21(24,25)26)28(2)20(29)32/h4-9H,3,10H2,1-2H3
51 atoms
Cl 4.953739 -2.206722 -0.353834
F  0.176728 -3.689212 -0.931048
F  -5.660631 -1.834495 0.561787
F  -5.329003 0.221008 1.130594
F  -5.481284 -0.312952 -0.935806
O  3.690291 0.153784 0.679188
O  -0.879179 -1.945917 2.268542
O  -0.808621 -0.800465 -2.103587
O  2.349069 1.474184 -1.335297
O  -0.176676 2.007493 -0.67262
O  -0.456033 3.403496 -2.401766
N  -0.864229 -1.373846 0.088781
N  -2.864775 -1.354695 1.315824
N  2.39349 3.442275 -0.15432
C  0.538104 -1.597101 0.053106
C  -3.514073 -0.944661 0.176685
C  -1.502856 -1.581794 1.29567
C  -1.465092 -0.956493 -1.092705
C  -2.882776 -0.741465 -0.988918
C  1.410188 -0.621769 0.49681
C  1.033779 -2.766225 -0.490079
C  -3.556975 -1.588479 2.587846
C  2.774449 -0.790753 0.342458
C  -5.010788 -0.716408 0.237733
C  2.390373 -2.982592 -0.600958
C  3.257087 -1.983888 -0.189639
C  3.310749 1.465717 0.803152
C  2.679038 2.167082 -0.236354
C  3.618888 2.149421 1.956357
C  3.309253 3.503792 2.042871
C  1.539315 2.110816 -2.299573
C  2.697315 4.102366 0.963483
C  0.198568 2.595151 -1.789224
C  -1.395926 2.427952 -0.030449
C  -1.197352 3.692343 0.772715
H  -3.400238 -0.417255 -1.877264
H  1.007257 0.278421 0.941617
H  -2.823864 -1.86144 3.334642
H  -4.055409 -0.688565 2.93229
H  -4.264088 -2.40797 2.501801
H  2.764961 -3.905873 -1.02223
H  4.099842 1.631706 2.776274
H  3.534925 4.070624 2.934365
H  2.050655 2.949329 -2.774663
H  1.35351 1.3575 -3.067625
H  2.438302 5.153239 0.983951
H  -1.656817 1.597769 0.623452
H  -2.19116 2.536587 -0.768427
H  -0.946477 4.547371 0.146224
H  -2.125826 3.925248 1.294346
H  -0.416685 3.568891 1.523753
elementType: Cl F O N C H
totalener: -2285.30963179 hartree
nucrepener: 4305.14295875 hartree
electener: -6590.45259055 hartree
twoeener: 5118.12929677 hartree
cpcmener: -0.05574332 hartree
kineticenergy: 2277.77054034 hartree
xcener: -184.623262029832 hartree
chargesum: 0.0000000
charge: -0.063341 -0.210758 -0.161146 -0.162440 -0.159559 -0.327249 -0.490002 -0.491575 -0.300657 -0.273701 -0.478434 -0.019674 -0.075681 -0.374744 0.037698 0.005433 0.414069 0.317760 -0.123869 -0.205618 0.206770 -0.205720 0.281634 0.535556 -0.120050 -0.004727 0.145102 0.372606 -0.155478 -0.135906 0.022706 -0.032350 0.398372 0.038074 -0.273633 0.137147 0.156405 0.115545 0.142437 0.141505 0.135340 0.155643 0.161946 0.124140 0.140604 0.148112 0.101676 0.112625 0.098883 0.109645 0.088882
qa: -0.0633 -0.2108 -0.1611 -0.1624 -0.1596 -0.3272 -0.4900 -0.4916 -0.3007 -0.2737 -0.4784 -0.0197 -0.0757 -0.3747 0.0377 0.0054 0.4141 0.3178 -0.1239 -0.2056 0.2068 -0.2057 0.2816 0.5356 -0.1201 -0.0047 0.1451 0.3726 -0.1555 -0.1359 0.0227 -0.0324 0.3984 0.0381 -0.2736 0.1371 0.1564 0.1155 0.1424 0.1415 0.1353 0.1556 0.1619 0.1241 0.1406 0.1481 0.1017 0.1126 0.0989 0.1096 0.0889
va: 1.2500 1.0840 1.1495 1.1455 1.1531 2.1070 2.0275 1.9984 2.0922 2.0900 2.0273 3.0926 3.3417 2.9675 3.4822 3.9699 4.2201 4.1498 3.8601 4.0005 4.1624 3.8366 3.8474 4.4096 3.9878 3.8999 3.8327 3.9886 3.9806 3.8397 3.8500 4.0246 4.0980 3.7878 3.9570 1.0227 1.0213 1.0248 0.9948 0.9935 1.0156 1.0008 0.9887 1.0237 0.9972 0.9950 0.9899 1.0069 1.0103 1.0083 0.9999
dispcorr: -0.035001851 hartree
energy: -2285.344633643934
dipole: 4.13047 -5.78003 -1.64956 29.19371 -28.76521 0.42850 10.36002 -7.60775 2.75227
magnitude: 3.23723 au
magnitude: 8.22838 debye
