program: Orca
programVersion: 5.0.2
elementType: Cl F F F F O O O O O O N N N C C C C C C C C C C C C C C C C C C C C C H H H H H H H H H H H H H H H H
charge: 0
multiplicity: 1
keywords: wb97x-d3
keywords: def2-TZVPP
keywords: def2/J RIJCOSX
keywords: DEFGRID2
keywords: scfconv7
keywords: smallprint printgap noloewdin
keywords: NOSOSCF
formula: C21H16ClF4N3O6
InChI: InChI=1/C21H16ClF4N3O6/c1-3-33-18(31)10-34-19-14(5-4-6-27-19)35-15-8-13(12(23)7-11(15)22)29-17(30)9-16(21(24,25)26)28(2)20(29)32/h4-9H,3,10H2,1-2H3
51 atoms
Cl 4.956594 -2.366341 0.569543
F  0.198845 -3.943862 0.134576
F  -5.581663 -1.580054 -0.325852
F  -5.162236 0.462598 -0.896053
F  -5.255195 -1.075954 -2.380887
O  3.824124 0.099797 -0.317867
O  -0.953366 -1.080211 1.55624
O  -0.513655 -2.011687 -2.845278
O  2.086929 1.38793 1.40917
O  -0.728423 3.408053 2.166936
O  -0.394997 2.070068 0.400872
N  -0.740255 -1.495342 -0.653786
N  -2.816421 -0.897849 0.267807
N  2.4220 3.388148 0.329445
C  0.645526 -1.717955 -0.434444
C  -3.374742 -1.065416 -0.975317
C  -1.475968 -1.150614 0.465231
C  -1.244374 -1.679055 -1.932946
C  -2.657552 -1.431736 -2.049177
C  1.547298 -0.681853 -0.591075
C  1.08444 -2.95637 -0.00979
C  -3.573228 -0.564471 1.480634
C  2.877736 -0.869178 -0.257775
C  -4.859037 -0.813231 -1.142699
C  2.411798 -3.1807 0.283122
C  3.300911 -2.126445 0.169381
C  3.490196 1.419286 -0.471666
C  2.655819 2.102561 0.426953
C  4.072814 2.134309 -1.493356
C  3.828756 3.500475 -1.589502
C  1.160868 2.045926 2.243775
C  2.997995 4.078394 -0.654774
C  -0.065191 2.50115 1.4785
C  -1.898998 4.01781 1.583628
C  -3.130759 3.151098 1.682523
H  -3.102772 -1.553309 -3.023391
H  1.189408 0.269307 -0.961203
H  -2.937482 0.007553 2.145585
H  -4.429433 0.057258 1.258673
H  -3.897451 -1.468344 1.99265
H  2.742982 -4.155496 0.614604
H  4.721787 1.630582 -2.198264
H  4.273784 4.091797 -2.376472
H  0.852297 1.306838 2.98601
H  1.61395 2.884684 2.774332
H  2.77866 5.137975 -0.687696
H  -1.68834 4.296987 0.550392
H  -2.029652 4.933719 2.156085
H  -3.077458 2.277529 1.036693
H  -3.309026 2.824083 2.706795
H  -3.992759 3.740789 1.368877
elementType: Cl F O N C H
totalener: -2285.31211237 hartree
nucrepener: 4237.84389994 hartree
electener: -6523.15601231 hartree
twoeener: 5052.95108773 hartree
cpcmener: -0.05134614 hartree
kineticenergy: 2277.74913968 hartree
xcener: -184.617213300529 hartree
chargesum: 0.0000000
charge: -0.064097 -0.211482 -0.160869 -0.161610 -0.158084 -0.321326 -0.493044 -0.495718 -0.298502 -0.294043 -0.478490 -0.040156 -0.070416 -0.391095 0.015848 0.009853 0.394769 0.373166 -0.152189 -0.200516 0.201160 -0.218689 0.303653 0.534329 -0.114331 -0.004836 0.136183 0.381158 -0.140395 -0.164309 0.029822 -0.005198 0.417569 0.043540 -0.252348 0.138457 0.151371 0.120488 0.131447 0.156890 0.134493 0.156031 0.163016 0.143868 0.126892 0.145657 0.096042 0.113850 0.075061 0.093520 0.103610
qa: -0.0641 -0.2115 -0.1609 -0.1616 -0.1581 -0.3213 -0.4930 -0.4957 -0.2985 -0.2940 -0.4785 -0.0402 -0.0704 -0.3911 0.0158 0.0099 0.3948 0.3732 -0.1522 -0.2005 0.2012 -0.2187 0.3037 0.5343 -0.1143 -0.0048 0.1362 0.3812 -0.1404 -0.1643 0.0298 -0.0052 0.4176 0.0435 -0.2523 0.1385 0.1514 0.1205 0.1314 0.1569 0.1345 0.1560 0.1630 0.1439 0.1269 0.1457 0.0960 0.1138 0.0751 0.0935 0.1036
va: 1.2493 1.0821 1.1512 1.1415 1.1538 2.1082 2.0056 2.0092 2.1069 2.1468 1.9920 3.1156 3.3579 2.9814 3.5060 3.9717 4.2094 4.1859 3.8901 4.0106 4.1611 3.8601 3.8582 4.4212 3.9851 3.8846 3.8378 3.9650 3.9684 3.8727 3.8543 4.0380 4.0499 3.8502 3.9148 1.0207 1.0271 1.0009 1.0040 0.9929 1.0162 1.0012 0.9896 0.9979 1.0248 0.9944 1.0071 0.9961 1.0053 1.0030 1.0076
dispcorr: -0.032139075 hartree
energy: -2285.344251444507
dipole: -1.54850 -0.32357 -1.87207 33.92147 -31.57870 2.34277 12.56953 -11.61770 0.95183
magnitude: 3.14630 au
magnitude: 7.99726 debye
