program: Orca
programVersion: 5.0.2
elementType: Cl F F F F O O O O O O N N N C C C C C C C C C C C C C C C C C C C C C H H H H H H H H H H H H H H H H
charge: 0
multiplicity: 1
keywords: wb97x-d3
keywords: def2-TZVPP
keywords: def2/J RIJCOSX
keywords: DEFGRID2
keywords: scfconv7
keywords: smallprint printgap noloewdin
keywords: NOSOSCF
formula: C21H16ClF4N3O6
InChI: InChI=1/C21H16ClF4N3O6/c1-3-33-18(31)10-34-19-14(5-4-6-27-19)35-15-8-13(12(23)7-11(15)22)29-17(30)9-16(21(24,25)26)28(2)20(29)32/h4-9H,3,10H2,1-2H3
51 atoms
Cl 5.016326 -2.192428 -0.671571
F  0.233337 -3.690189 -1.162418
F  -5.599026 -1.068218 0.977835
F  -4.723683 0.82836 1.520493
F  -5.22511 0.412084 -0.520158
O  3.784652 0.039682 0.63409
O  -0.820799 -2.366139 2.128388
O  -0.738635 -0.600635 -2.031867
O  2.246205 1.634787 -1.01057
O  -0.963839 2.910457 -1.867909
O  -0.268816 1.985595 0.049756
N  -0.778793 -1.433979 0.076054
N  -2.709235 -1.31377 1.405925
N  2.429303 3.407664 0.446387
C  0.617537 -1.685311 -0.013696
C  -3.340136 -0.670742 0.368482
C  -1.40729 -1.75137 1.264972
C  -1.372636 -0.816167 -1.016929
C  -2.747571 -0.447843 -0.813908
C  1.502348 -0.745961 0.483944
C  1.097477 -2.795981 -0.678237
C  -3.384575 -1.670546 2.658718
C  2.859453 -0.877766 0.255185
C  -4.73884 -0.129011 0.589842
C  2.451136 -2.980638 -0.866963
C  3.32617 -2.010205 -0.408665
C  3.421503 1.313575 0.988876
C  2.683003 2.158862 0.144235
C  3.877139 1.822502 2.183815
C  3.606155 3.149336 2.501712
C  1.287566 2.342241 -1.76147
C  2.881743 3.89816 1.600006
C  -0.058623 2.381994 -1.069355
C  -2.318451 3.071967 -1.394897
C  -3.243505 2.983832 -2.579648
H  -3.248044 0.056214 -1.625325
H  1.108861 0.103695 1.024711
H  -4.021125 -2.541384 2.522728
H  -2.634676 -1.904693 3.402919
H  -3.960972 -0.837815 3.043935
H  2.816704 -3.856202 -1.386675
H  4.445997 1.191335 2.854456
H  3.94993 3.580985 3.430404
H  1.607061 3.361977 -1.989654
H  1.195103 1.807757 -2.707376
H  2.652452 4.937078 1.80056
H  -2.387922 4.043942 -0.904078
H  -2.559597 2.304501 -0.660867
H  -3.177249 2.009365 -3.064375
H  -4.269339 3.117088 -2.236712
H  -3.036087 3.756522 -3.31977
elementType: Cl F O N C H
totalener: -2285.31049200 hartree
nucrepener: 4289.88562424 hartree
electener: -6575.19611625 hartree
twoeener: 5104.72919241 hartree
cpcmener: -0.04938714 hartree
kineticenergy: 2277.74627754 hartree
xcener: -184.618432513869 hartree
chargesum: -0.0000000
charge: -0.064518 -0.210640 -0.160631 -0.166320 -0.160701 -0.323277 -0.490604 -0.488685 -0.299648 -0.288489 -0.463635 -0.025480 -0.094804 -0.386968 0.039713 0.044387 0.419474 0.299855 -0.170321 -0.222321 0.203423 -0.191383 0.299716 0.545857 -0.117369 -0.009477 0.156223 0.353749 -0.145172 -0.163452 0.022277 -0.006871 0.409422 0.038061 -0.255687 0.160447 0.157532 0.142400 0.116260 0.132710 0.135091 0.154576 0.161785 0.135147 0.147759 0.146498 0.124035 0.083191 0.083344 0.093135 0.100385
qa: -0.0645 -0.2106 -0.1606 -0.1663 -0.1607 -0.3233 -0.4906 -0.4887 -0.2996 -0.2885 -0.4636 -0.0255 -0.0948 -0.3870 0.0397 0.0444 0.4195 0.2999 -0.1703 -0.2223 0.2034 -0.1914 0.2997 0.5459 -0.1174 -0.0095 0.1562 0.3537 -0.1452 -0.1635 0.0223 -0.0069 0.4094 0.0381 -0.2557 0.1604 0.1575 0.1424 0.1163 0.1327 0.1351 0.1546 0.1618 0.1351 0.1478 0.1465 0.1240 0.0832 0.0833 0.0931 0.1004
va: 1.2489 1.0824 1.1547 1.1391 1.1485 2.1105 2.0233 2.0053 2.1034 2.1421 2.0069 3.0974 3.3751 2.9833 3.4726 3.9441 4.2221 4.2014 3.8388 4.0102 4.1746 3.8497 3.8499 4.4031 3.9744 3.8893 3.8163 4.0055 3.9701 3.8710 3.8313 4.0413 4.0706 3.8247 3.9514 0.9998 1.0275 0.9871 1.0174 1.0032 1.0155 1.0018 0.9900 1.0204 1.0048 0.9948 0.9963 1.0101 1.0079 1.0078 1.0056
dispcorr: -0.033587033 hartree
energy: -2285.344079034978
dipole: -3.23725 1.07536 -2.16189 25.65152 -24.12982 1.52171 0.01520 0.90620 0.92140
magnitude: 2.79970 au
magnitude: 7.11628 debye
