program: Orca
programVersion: 5.0.2
elementType: Cl F F F F O O O O O O N N N C C C C C C C C C C C C C C C C C C C C C H H H H H H H H H H H H H H H H
charge: 0
multiplicity: 1
keywords: wb97x-d3
keywords: def2-TZVPP
keywords: def2/J RIJCOSX
keywords: DEFGRID2
keywords: scfconv7
keywords: smallprint printgap noloewdin
keywords: NOSOSCF
formula: C21H16ClF4N3O6
InChI: InChI=1/C21H16ClF4N3O6/c1-3-33-18(31)10-34-19-14(5-4-6-27-19)35-15-8-13(12(23)7-11(15)22)29-17(30)9-16(21(24,25)26)28(2)20(29)32/h4-9H,3,10H2,1-2H3
51 atoms
Cl 4.542808 -1.252124 -1.199432
F  -0.23807 -2.739878 -1.659741
F  -5.990815 -1.689853 0.68976
F  -5.389017 -1.176565 2.700311
F  -5.683392 0.35753 1.237475
O  3.448214 0.290561 0.968363
O  -1.040014 -3.150049 1.344036
O  -1.251555 0.928075 -0.615601
O  2.246384 2.212199 -0.521961
O  1.176756 1.229117 -2.607898
O  0.754637 3.229563 -3.525967
N  -1.145546 -1.117882 0.366135
N  -3.06568 -2.119706 1.285832
N  2.217829 3.684427 1.241534
C  0.23685 -1.20519 0.046024
C  -3.763318 -0.971824 1.002278
C  -1.710456 -2.195712 1.025474
C  -1.819278 0.039418 -0.017586
C  -3.204454 0.074319 0.376436
C  1.162962 -0.441361 0.733811
C  0.659323 -2.009185 -0.995886
C  -3.655633 -3.295123 1.933217
C  2.493361 -0.449733 0.350463
C  -5.220338 -0.874428 1.413129
C  1.983356 -2.0589 -1.374871
C  2.895209 -1.260674 -0.707013
C  3.102061 1.491857 1.521998
C  2.508725 2.506553 0.751155
C  3.391645 1.75511 2.838685
C  3.093015 3.014918 3.354901
C  1.555972 3.163847 -1.30131
C  2.503371 3.93798 2.519777
C  1.131291 2.542922 -2.609001
C  0.744898 0.517982 -3.7819
C  1.879581 0.333056 -4.760105
H  -3.755832 0.972533 0.148844
H  0.830592 0.173136 1.561855
H  -4.676077 -3.449531 1.6033
H  -3.09558 -4.174589 1.637536
H  -3.621495 -3.208535 3.017431
H  2.290531 -2.688107 -2.199752
H  3.852073 0.99126 3.452581
H  3.311632 3.260113 4.384428
H  0.653097 3.522923 -0.796276
H  2.17901 4.035898 -1.514225
H  2.250575 4.928505 2.877831
H  -0.103359 1.025724 -4.242259
H  0.393552 -0.442144 -3.409463
H  2.72511 -0.177221 -4.296952
H  1.535377 -0.280325 -5.593756
H  2.226988 1.282304 -5.168438
elementType: Cl F O N C H
totalener: -2285.31897099 hartree
nucrepener: 4216.62472402 hartree
electener: -6501.94369501 hartree
twoeener: 5030.58821997 hartree
cpcmener: -0.04527645 hartree
kineticenergy: 2277.76094199 hartree
xcener: -184.614148147804 hartree
chargesum: -0.0000000
charge: -0.062742 -0.213428 -0.161008 -0.161062 -0.158378 -0.325674 -0.462480 -0.468436 -0.285117 -0.262838 -0.466674 -0.062863 -0.101091 -0.390558 0.074285 0.013947 0.411042 0.351345 -0.150189 -0.183597 0.175310 -0.191425 0.271784 0.534915 -0.131713 0.013173 0.118410 0.396319 -0.140921 -0.157756 0.006761 -0.015257 0.420495 0.003326 -0.244117 0.138506 0.150179 0.130397 0.117149 0.139309 0.133690 0.154944 0.157090 0.114621 0.131724 0.142699 0.108596 0.112665 0.083094 0.098050 0.093500
qa: -0.0627 -0.2134 -0.1610 -0.1611 -0.1584 -0.3257 -0.4625 -0.4684 -0.2851 -0.2628 -0.4667 -0.0629 -0.1011 -0.3906 0.0743 0.0139 0.4110 0.3513 -0.1502 -0.1836 0.1753 -0.1914 0.2718 0.5349 -0.1317 0.0132 0.1184 0.3963 -0.1409 -0.1578 0.0068 -0.0153 0.4205 0.0033 -0.2441 0.1385 0.1502 0.1304 0.1171 0.1393 0.1337 0.1549 0.1571 0.1146 0.1317 0.1427 0.1086 0.1127 0.0831 0.0980 0.0935
va: 1.2482 1.0739 1.1456 1.1500 1.1521 2.0971 2.0577 2.0465 2.1086 2.1345 2.0417 3.1103 3.3609 3.0081 3.5007 3.9789 4.2325 4.1879 3.8914 4.0108 4.0834 3.8591 3.8147 4.4206 3.9513 3.8880 3.8684 3.9962 3.9621 3.8683 3.9014 4.0560 4.1624 3.8414 3.9338 1.0226 1.0112 1.0062 1.0109 0.9880 1.0165 1.0007 0.9912 1.0102 1.0119 0.9954 1.0136 0.9856 1.0048 1.0071 1.0108
dispcorr: -0.032212113 hartree
energy: -2285.351183104071
dipole: 16.24226 -17.62154 -1.37928 12.04626 -13.21460 -1.16834 -9.09607 11.11446 2.01839
magnitude: 2.70948 au
magnitude: 6.88696 debye
