program: Orca
programVersion: 5.0.2
elementType: Cl F F F F O O O O O O N N N C C C C C C C C C C C C C C C C C C C C C H H H H H H H H H H H H H H H H
charge: 0
multiplicity: 1
keywords: wb97x-d3
keywords: def2-TZVPP
keywords: def2/J RIJCOSX
keywords: DEFGRID2
keywords: scfconv7
keywords: smallprint printgap noloewdin
keywords: NOSOSCF
formula: C21H16ClF4N3O6
InChI: InChI=1/C21H16ClF4N3O6/c1-3-33-18(31)10-34-19-14(5-4-6-27-19)35-15-8-13(12(23)7-11(15)22)29-17(30)9-16(21(24,25)26)28(2)20(29)32/h4-9H,3,10H2,1-2H3
51 atoms
Cl 5.014219 -2.200873 -0.660694
F  0.22371 -3.6932 -1.105408
F  -5.222615 0.420646 -0.472889
F  -5.605247 -1.071317 1.010716
F  -4.734444 0.820948 1.574107
O  3.790538 0.051123 0.623476
O  -0.803333 -2.310613 2.200599
O  -0.753641 -0.635589 -1.997798
O  2.239094 1.59228 -1.061091
O  -0.944525 2.957132 -1.876513
O  -0.275165 1.935433 0.0013
N  -0.775684 -1.427077 0.12695
N  -2.708512 -1.306031 1.456545
N  2.391846 3.392763 0.356348
C  0.61971 -1.681477 0.029223
C  -3.341758 -0.669774 0.416769
C  -1.397295 -1.7259 1.324788
C  -1.376598 -0.829694 -0.975206
C  -2.750493 -0.452482 -0.766849
C  1.510716 -0.738836 0.508232
C  1.092737 -2.797626 -0.631746
C  -3.384694 -1.65901 2.707863
C  2.86571 -0.87292 0.267194
C  -4.741741 -0.129302 0.635953
C  2.444793 -2.986082 -0.829146
C  3.326054 -2.013504 -0.386721
C  3.424649 1.329749 0.941786
C  2.671304 2.144282 0.079042
C  3.87852 1.878396 2.119944
C  3.585718 3.208102 2.40689
C  1.275215 2.282172 -1.818158
C  2.837977 3.920896 1.494001
C  -0.058633 2.361321 -1.10382
C  -2.297571 3.129294 -1.410771
C  -3.224758 2.991762 -2.590105
H  -3.251533 0.046893 -1.580557
H  1.12251 0.120005 1.037902
H  -2.636949 -1.948922 3.435006
H  -3.918222 -0.8097 3.120327
H  -4.061968 -2.497092 2.560983
H  2.80456 -3.866881 -1.344385
H  4.461765 1.273803 2.803114
H  3.92821 3.668703 3.322493
H  1.604323 3.287614 -2.093507
H  1.155535 1.710247 -2.739635
H  2.583895 4.958687 1.673017
H  -2.370388 4.120757 -0.959752
H  -2.534738 2.393415 -0.643454
H  -4.251764 3.138604 -2.254697
H  -3.018037 3.734119 -3.361436
H  -3.156872 1.999384 -3.037242
elementType: Cl F O N C H
totalener: -2285.31888003 hartree
nucrepener: 4291.25791689 hartree
electener: -6576.57679692 hartree
twoeener: 5105.91644468 hartree
cpcmener: -0.03953587 hartree
kineticenergy: 2277.77187463 hartree
xcener: -184.620780153845 hartree
chargesum: 0.0000000
charge: -0.064473 -0.210498 -0.161214 -0.160861 -0.166085 -0.318042 -0.462779 -0.456728 -0.291743 -0.284736 -0.443194 -0.030283 -0.098136 -0.382653 0.054210 0.042018 0.398381 0.283529 -0.175384 -0.213216 0.199568 -0.196508 0.294315 0.545240 -0.119392 -0.008296 0.149112 0.355081 -0.143775 -0.161915 0.020736 -0.007922 0.395041 0.039169 -0.252995 0.155090 0.152727 0.117211 0.133248 0.139482 0.132304 0.151714 0.157743 0.132102 0.145611 0.143103 0.118751 0.081858 0.092038 0.099412 0.082035
qa: -0.0645 -0.2105 -0.1612 -0.1609 -0.1661 -0.3180 -0.4628 -0.4567 -0.2917 -0.2847 -0.4432 -0.0303 -0.0981 -0.3827 0.0542 0.0420 0.3984 0.2835 -0.1754 -0.2132 0.1996 -0.1965 0.2943 0.5452 -0.1194 -0.0083 0.1491 0.3551 -0.1438 -0.1619 0.0207 -0.0079 0.3950 0.0392 -0.2530 0.1551 0.1527 0.1172 0.1332 0.1395 0.1323 0.1517 0.1577 0.1321 0.1456 0.1431 0.1188 0.0819 0.0920 0.0994 0.0820
va: 1.2490 1.0830 1.1472 1.1535 1.1392 2.1176 2.0581 2.0455 2.1132 2.1439 2.0304 3.0854 3.3589 2.9839 3.4792 3.9463 4.2479 4.2309 3.8322 4.0146 4.1782 3.8464 3.8527 4.4016 3.9745 3.8917 3.8352 4.0019 3.9690 3.8715 3.8329 4.0469 4.0930 3.8295 3.9500 1.0025 1.0296 1.0214 1.0014 0.9882 1.0165 1.0027 0.9913 1.0216 1.0044 0.9954 0.9961 1.0137 1.0080 1.0059 1.0086
dispcorr: -0.033560657 hartree
energy: -2285.352440688587
dipole: -3.20669 1.19827 -2.00841 25.82770 -24.33083 1.49687 -0.47634 1.31653 0.84019
magnitude: 2.64202 au
magnitude: 6.71548 debye
