program: Orca
programVersion: 5.0.2
elementType: Cl F F F F O O O O O O N N N C C C C C C C C C C C C C C C C C C C C C H H H H H H H H H H H H H H H H
charge: 0
multiplicity: 1
keywords: wb97x-d3
keywords: def2-TZVPP
keywords: def2/J RIJCOSX
keywords: DEFGRID2
keywords: scfconv7
keywords: smallprint printgap noloewdin
keywords: NOSOSCF
formula: C21H16ClF4N3O6
InChI: InChI=1/C21H16ClF4N3O6/c1-3-33-18(31)10-34-19-14(5-4-6-27-19)35-15-8-13(12(23)7-11(15)22)29-17(30)9-16(21(24,25)26)28(2)20(29)32/h4-9H,3,10H2,1-2H3
51 atoms
Cl 4.937273 -2.287929 -0.598072
F  0.116581 -3.691007 -0.985469
F  -5.514945 -0.524308 -0.742548
F  -5.578192 -1.880507 0.913874
F  -5.316177 0.235076 1.250077
O  3.766389 0.037729 0.585914
O  -0.817361 -2.116867 2.304484
O  -0.838011 -0.668188 -1.981145
O  2.261447 1.588732 -1.133066
O  -0.572624 3.595328 -1.867507
O  -0.306587 2.077214 -0.242182
N  -0.838844 -1.395815 0.166444
N  -2.794719 -1.367567 1.463989
N  2.446057 3.40243 0.258609
C  0.555978 -1.643949 0.064744
C  -3.486117 -0.958001 0.350679
C  -1.448227 -1.664924 1.377201
C  -1.467488 -0.898307 -0.970639
C  -2.888727 -0.720598 -0.826193
C  1.463671 -0.695525 0.497203
C  1.006352 -2.795698 -0.550731
C  -3.420105 -1.580003 2.772258
C  2.816429 -0.873217 0.264551
C  -4.987548 -0.780058 0.448849
C  2.352446 -3.022029 -0.741997
C  3.252815 -2.050721 -0.338673
C  3.432332 1.328856 0.88208
C  2.704535 2.145052 0.000518
C  3.891038 1.886345 2.053852
C  3.625499 3.226708 2.317736
C  1.390845 2.351167 -1.934753
C  2.896488 3.939948 1.390663
C  0.084728 2.648573 -1.227447
C  -1.863727 4.000737 -1.375523
C  -2.965275 3.068683 -1.818139
H  -3.437089 -0.402757 -1.698152
H  1.093254 0.192759 0.990649
H  -4.119969 -0.785051 2.999502
H  -3.915662 -2.546008 2.823622
H  -2.650665 -1.551267 3.533541
H  2.692214 -3.931487 -1.219512
H  4.456695 1.28038 2.750449
H  3.9738 3.694537 3.227428
H  1.856018 3.275946 -2.281604
H  1.178021 1.7348 -2.811086
H  2.661819 4.984976 1.552024
H  -2.00993 4.994682 -1.794835
H  -1.83373 4.097711 -0.289409
H  -3.924687 3.487096 -1.510546
H  -2.983999 2.959192 -2.902734
H  -2.877345 2.080399 -1.368539
elementType: Cl F O N C H
totalener: -2285.32037311 hartree
nucrepener: 4244.31971564 hartree
electener: -6529.64008875 hartree
twoeener: 5059.53828896 hartree
cpcmener: -0.04008805 hartree
kineticenergy: 2277.78539152 hartree
xcener: -184.621945478643 hartree
chargesum: -0.0000000
charge: -0.064338 -0.211310 -0.160256 -0.161408 -0.162960 -0.317825 -0.464905 -0.460222 -0.290326 -0.291137 -0.452731 -0.031018 -0.098983 -0.384495 0.033721 0.032586 0.406158 0.302516 -0.171061 -0.193309 0.208017 -0.202695 0.285762 0.540189 -0.124244 -0.000932 0.134787 0.372782 -0.139788 -0.161394 0.023045 -0.007461 0.405963 0.040348 -0.244131 0.144938 0.150263 0.137049 0.140141 0.116030 0.132558 0.152303 0.158154 0.126488 0.142321 0.142481 0.110977 0.092346 0.098509 0.090629 0.075867
qa: -0.0643 -0.2113 -0.1603 -0.1614 -0.1630 -0.3178 -0.4649 -0.4602 -0.2903 -0.2911 -0.4527 -0.0310 -0.0990 -0.3845 0.0337 0.0326 0.4062 0.3025 -0.1711 -0.1933 0.2080 -0.2027 0.2858 0.5402 -0.1242 -0.0009 0.1348 0.3728 -0.1398 -0.1614 0.0230 -0.0075 0.4060 0.0403 -0.2441 0.1449 0.1503 0.1370 0.1401 0.1160 0.1326 0.1523 0.1582 0.1265 0.1423 0.1425 0.1110 0.0923 0.0985 0.0906 0.0759
va: 1.2490 1.0829 1.1492 1.1505 1.1438 2.1154 2.0543 2.0371 2.1153 2.1501 2.0208 3.0931 3.3550 2.9832 3.5033 3.9632 4.2401 4.1824 3.8439 4.0066 4.1633 3.8531 3.8688 4.4101 3.9866 3.8866 3.8506 3.9767 3.9665 3.8715 3.8584 4.0442 4.0692 3.8567 3.9220 1.0165 1.0290 1.0021 0.9881 1.0162 1.0168 1.0023 0.9911 1.0247 0.9993 0.9952 0.9966 1.0093 1.0088 1.0066 1.0030
dispcorr: -0.032036256 hartree
energy: -2285.352409368534
dipole: -0.29639 -1.44487 -1.74126 30.76779 -29.04113 1.72667 2.05963 -1.10366 0.95597
magnitude: 2.63197 au
magnitude: 6.68993 debye
