program: Orca
programVersion: 5.0.2
elementType: Cl F F F F O O O O O O N N N C C C C C C C C C C C C C C C C C C C C C H H H H H H H H H H H H H H H H
charge: 0
multiplicity: 1
keywords: wb97x-d3
keywords: def2-TZVPP
keywords: def2/J RIJCOSX
keywords: DEFGRID2
keywords: scfconv7
keywords: smallprint printgap noloewdin
keywords: NOSOSCF
formula: C21H16ClF4N3O6
InChI: InChI=1/C21H16ClF4N3O6/c1-3-33-18(31)10-34-19-14(5-4-6-27-19)35-15-8-13(12(23)7-11(15)22)29-17(30)9-16(21(24,25)26)28(2)20(29)32/h4-9H,3,10H2,1-2H3
51 atoms
Cl 4.926105 -2.261048 -0.637414
F  0.108116 -3.664793 -1.05156
F  -5.541268 -0.515567 -0.674287
F  -5.592263 -1.839463 1.00794
F  -5.286972 0.278448 1.298921
O  3.754495 0.026674 0.614662
O  -0.820693 -2.191778 2.273729
O  -0.875265 -0.626041 -1.97305
O  2.290491 1.589365 -1.127768
O  -0.529854 3.600459 -1.907723
O  -0.273038 2.108279 -0.25684
N  -0.8511 -1.398102 0.158671
N  -2.79187 -1.3876 1.481485
N  2.485826 3.407883 0.256784
C  0.54433 -1.639418 0.04222
C  -3.496294 -0.954621 0.386426
C  -1.450595 -1.698854 1.367241
C  -1.492762 -0.877268 -0.960112
C  -2.912579 -0.700823 -0.794293
C  1.450972 -0.699222 0.494873
C  0.996248 -2.776094 -0.600104
C  -3.383804 -1.633539 2.79976
C  2.804287 -0.871883 0.261478
C  -4.993069 -0.75781 0.510058
C  2.34232 -2.994837 -0.799482
C  3.241644 -2.032768 -0.372207
C  3.430593 1.322083 0.903284
C  2.726177 2.144817 0.009174
C  3.883746 1.878174 2.077935
C  3.636918 3.224182 2.331338
C  1.435902 2.35729 -1.941151
C  2.93151 3.944229 1.391397
C  0.123579 2.663386 -1.248994
C  -1.82306 4.01348 -1.427448
C  -2.921461 3.066061 -1.845815
H  -3.470858 -0.363351 -1.652605
H  1.080414 0.1783 1.0076
H  -4.210406 -0.960486 2.989217
H  -3.714897 -2.665768 2.897386
H  -2.638328 -1.432103 3.561024
H  2.682894 -3.891783 -1.299613
H  4.432834 1.267022 2.783219
H  3.982597 3.6913 3.242408
H  1.911366 3.278898 -2.282662
H  1.229911 1.741807 -2.819691
H  2.712487 4.994016 1.543628
H  -1.972892 4.995943 -1.872023
H  -1.793831 4.138511 -0.343958
H  -3.882197 3.487026 -1.546146
H  -2.941848 2.930626 -2.92754
H  -2.827736 2.08911 -1.373484
elementType: Cl F O N C H
totalener: -2285.32072406 hartree
nucrepener: 4240.92483156 hartree
electener: -6526.24555563 hartree
twoeener: 5056.14015628 hartree
cpcmener: -0.04041807 hartree
kineticenergy: 2277.77264608 hartree
xcener: -184.619045938542 hartree
chargesum: -0.0000000
charge: -0.063918 -0.211180 -0.159435 -0.161404 -0.163291 -0.318051 -0.465129 -0.461176 -0.290978 -0.291561 -0.451328 -0.031689 -0.103549 -0.384499 0.034170 0.029500 0.412102 0.305020 -0.173172 -0.190234 0.207810 -0.186562 0.282618 0.538652 -0.125255 0.000916 0.135155 0.374407 -0.142113 -0.161084 0.023354 -0.008234 0.404641 0.040514 -0.243998 0.145519 0.149673 0.126929 0.138793 0.115434 0.132752 0.152482 0.158129 0.126595 0.142501 0.142460 0.110940 0.092457 0.098569 0.090945 0.074803
qa: -0.0639 -0.2112 -0.1594 -0.1614 -0.1633 -0.3181 -0.4651 -0.4612 -0.2910 -0.2916 -0.4513 -0.0317 -0.1035 -0.3845 0.0342 0.0295 0.4121 0.3050 -0.1732 -0.1902 0.2078 -0.1866 0.2826 0.5387 -0.1253 0.0009 0.1352 0.3744 -0.1421 -0.1611 0.0234 -0.0082 0.4046 0.0405 -0.2440 0.1455 0.1497 0.1269 0.1388 0.1154 0.1328 0.1525 0.1581 0.1266 0.1425 0.1425 0.1109 0.0925 0.0986 0.0909 0.0748
va: 1.2497 1.0830 1.1503 1.1523 1.1426 2.1149 2.0537 2.0369 2.1138 2.1493 2.0231 3.0988 3.3693 2.9828 3.4983 3.9617 4.2310 4.1843 3.8431 4.0070 4.1633 3.8675 3.8666 4.4180 3.9876 3.8894 3.8503 3.9772 3.9651 3.8713 3.8598 4.0446 4.0706 3.8578 3.9219 1.0158 1.0287 1.0089 0.9880 1.0076 1.0168 1.0023 0.9911 1.0246 0.9992 0.9952 0.9966 1.0090 1.0089 1.0064 1.0031
dispcorr: -0.031958234 hartree
energy: -2285.352682298307
dipole: 0.08446 -1.80343 -1.71897 30.47046 -28.77986 1.69060 1.88777 -0.90917 0.97861
magnitude: 2.60205 au
magnitude: 6.61388 debye
