program: Orca
programVersion: 5.0.2
elementType: Cl F F F F O O O O O O N N N C C C C C C C C C C C C C C C C C C C C C H H H H H H H H H H H H H H H H
charge: 0
multiplicity: 1
keywords: wb97x-d3
keywords: def2-TZVPP
keywords: def2/J RIJCOSX
keywords: DEFGRID2
keywords: scfconv7
keywords: smallprint printgap noloewdin
keywords: NOSOSCF
formula: C21H16ClF4N3O6
InChI: InChI=1/C21H16ClF4N3O6/c1-3-33-18(31)10-34-19-14(5-4-6-27-19)35-15-8-13(12(23)7-11(15)22)29-17(30)9-16(21(24,25)26)28(2)20(29)32/h4-9H,3,10H2,1-2H3
51 atoms
Cl 5.005888 -2.226291 -0.650932
F  0.215258 -3.734869 -1.016812
F  -5.321707 0.049099 -0.540557
F  -5.589059 -1.74507 0.601367
F  -5.166465 0.128424 1.590927
O  3.791361 0.047874 0.598113
O  -0.758066 -2.206142 2.309913
O  -0.768147 -0.706028 -1.956695
O  2.231714 1.560401 -1.104913
O  -0.840055 3.17599 -1.903574
O  -0.320275 1.918475 -0.130988
N  -0.778238 -1.466354 0.179525
N  -2.742406 -1.469349 1.468522
N  2.373318 3.376524 0.291297
C  0.619387 -1.702984 0.077516
C  -3.400508 -0.909123 0.401792
C  -1.388984 -1.746495 1.386586
C  -1.393964 -0.916117 -0.939339
C  -2.79432 -0.637056 -0.762983
C  1.511379 -0.74699 0.525512
C  1.088289 -2.830515 -0.567445
C  -3.380915 -1.733303 2.760729
C  2.864105 -0.884678 0.271956
C  -4.882618 -0.615249 0.522344
C  2.437818 -3.020705 -0.776616
C  3.320883 -2.037463 -0.363028
C  3.420618 1.328421 0.901586
C  2.662802 2.127058 0.028402
C  3.869833 1.893518 2.073382
C  3.569161 3.225127 2.343635
C  1.302277 2.269442 -1.887546
C  2.817132 3.921757 1.422271
C  -0.030006 2.425095 -1.184222
C  -2.176421 3.388967 -1.408582
C  -2.909814 4.24341 -2.409037
H  -3.320413 -0.211048 -1.601693
H  1.125744 0.122077 1.040348
H  -2.768331 -2.433859 3.314726
H  -3.472095 -0.8207 3.346246
H  -4.352909 -2.196466 2.6307
H  2.793125 -3.910757 -1.278891
H  4.455866 1.29989 2.763703
H  3.908728 3.699361 3.253321
H  1.679873 3.246856 -2.196531
H  1.155289 1.670643 -2.788529
H  2.554421 4.959387 1.588786
H  -2.126952 3.880161 -0.434844
H  -2.674428 2.425868 -1.278035
H  -2.426044 5.210613 -2.547907
H  -2.992526 3.751058 -3.378318
H  -3.920037 4.427394 -2.042611
elementType: Cl F O N C H
totalener: -2285.32139841 hartree
nucrepener: 4246.42406413 hartree
electener: -6531.74546254 hartree
twoeener: 5061.44020490 hartree
cpcmener: -0.03965659 hartree
kineticenergy: 2277.77228394 hartree
xcener: -184.619079703196 hartree
chargesum: 0.0000000
charge: -0.064222 -0.211141 -0.161455 -0.161390 -0.161965 -0.318386 -0.464326 -0.460003 -0.290645 -0.283464 -0.449015 -0.033252 -0.099594 -0.384712 0.047945 0.041311 0.402639 0.299233 -0.166944 -0.197312 0.203711 -0.194268 0.284625 0.536630 -0.122255 -0.004849 0.142774 0.363259 -0.141426 -0.161263 0.025199 -0.008247 0.397979 0.043349 -0.249904 0.137680 0.150032 0.117022 0.139637 0.131511 0.132606 0.152042 0.158043 0.131051 0.145498 0.143020 0.100418 0.094235 0.091159 0.089137 0.088292
qa: -0.0642 -0.2111 -0.1615 -0.1614 -0.1620 -0.3184 -0.4643 -0.4600 -0.2906 -0.2835 -0.4490 -0.0333 -0.0996 -0.3847 0.0479 0.0413 0.4026 0.2992 -0.1669 -0.1973 0.2037 -0.1943 0.2846 0.5366 -0.1223 -0.0048 0.1428 0.3633 -0.1414 -0.1613 0.0252 -0.0082 0.3980 0.0433 -0.2499 0.1377 0.1500 0.1170 0.1396 0.1315 0.1326 0.1520 0.1580 0.1311 0.1455 0.1430 0.1004 0.0942 0.0912 0.0891 0.0883
va: 1.2494 1.0829 1.1465 1.1475 1.1488 2.1158 2.0562 2.0398 2.1152 2.1499 2.0264 3.0924 3.3596 2.9831 3.4917 3.9558 4.2467 4.1984 3.8587 4.0062 4.1722 3.8507 3.8623 4.4158 3.9808 3.8904 3.8427 3.9908 3.9683 3.8714 3.8529 4.0468 4.0702 3.8516 3.9721 1.0199 1.0298 1.0183 0.9877 1.0030 1.0164 1.0025 0.9912 1.0234 1.0018 0.9953 0.9966 0.9860 1.0038 1.0035 1.0066
dispcorr: -0.031775349 hartree
energy: -2285.353173762489
dipole: -1.49589 -0.38980 -1.88569 31.58410 -29.98796 1.59613 0.42466 0.45503 0.87970
magnitude: 2.62246 au
magnitude: 6.66577 debye
