program: Gaussian 09
title: 000056510
version: EM64L-G09RevD.01
frameworkgroup: C1[X(C22H29NO3)]
method: RPBEPBE
basis: SDD
operation: Freq
keyword: #p
keyword: freq=noraman
keyword: PBEPBE/SDD
title: #p freq=noraman PBEPBE/SDD
converged: NO YES NO NO
title: Mulliken charges:
elementType: O O O N C C C C C C C C C C C C C C C C C C C C C C H H H H H H H H H H H H H H H H H H H H H H H H H H H H H
charge: -0.254089 -0.251354 -0.447953 0.001858 -0.180196 -0.012778 -0.461335 -0.458363 -0.485317 -0.443707 -0.454981 0.174926 -0.053859 0.416640 0.045124 -0.386942 -0.391111 -0.090559 -0.476429 -0.356117 -0.337651 -0.235747 -0.227925 -0.358976 -0.242137 -0.694446 0.236137 0.252147 0.215454 0.214931 0.247604 0.209211 0.244358 0.250472 0.230530 0.228051 0.243484 0.225589 0.366584 0.243624 0.270313 0.235760 0.238674 0.216998 0.205102 0.186519 0.189210 0.224417 0.226152 0.196754 0.199780 0.227361 0.218268 0.210688 0.209250
chargesum: 0.00000
title: Mulliken charges with hydrogens summed into heavy atoms:
elementType: O O O N C C C C C C C C C C C C C C C C C C C C C C
charge: -0.254089 -0.251354 -0.081369 0.001858 0.055941 0.239369 -0.030949 -0.001548 0.009513 0.014874 0.014091 0.174926 -0.053859 0.416640 0.045124 -0.143318 -0.120798 -0.090559 -0.001995 0.065983 0.038078 -0.011330 -0.001773 0.037558 -0.014776 -0.056240
polarizability: 2.70862603e+02 -2.39611042e+01 2.38681662e+02 -4.70934221e+00 -7.63315639e+00 2.30259587e+02
1716.lowfreq: -9.3608 -3.3750 -0.0007 0.0001 0.0006 5.4047 13.6829 20.4430 20.9547
frequency: 12.5169 19.8947 20.6157 30.9013 33.3766 36.7146 48.9435 63.2895 70.3834 77.3254 86.3568 101.1898 124.0884 130.5959 153.5663 194.9169 206.2883 215.1914 231.0322 259.1804 267.5945 274.2524 288.2193 311.4201 322.6816 355.9701 373.6453 395.3736 402.4986 405.8985 408.1867 425.3969 436.7674 479.0162 500.7781 527.1518 537.2995 573.0698 597.8823 603.1391 615.8403 639.0363 693.2009 703.1024 724.2657 733.5361 747.5177 749.2401 772.7779 788.2347 808.4774 814.3991 832.4034 833.9595 857.5961 874.0548 877.9765 887.6669 906.6961 916.0315 936.8409 939.5229 955.3255 956.3448 980.7675 984.2818 990.5279 990.9121 997.0643 997.5249 1000.5729 1020.9652 1026.8658 1043.1388 1053.8195 1076.2094 1077.2155 1082.2221 1098.6709 1107.6607 1111.5663 1129.5043 1140.5930 1166.5865 1170.9318 1176.2315 1184.1881 1199.7218 1200.8786 1216.9217 1219.3867 1231.6891 1239.5837 1257.7724 1271.6790 1287.3812 1292.9503 1296.8095 1297.8148 1300.2357 1306.5535 1309.9958 1313.0298 1313.5692 1315.0668 1330.4062 1337.9567 1339.5089 1348.3005 1353.7699 1361.7800 1383.5880 1390.3059 1435.2402 1442.7373 1452.0723 1462.1595 1463.9806 1469.0366 1469.2017 1471.7892 1477.8955 1478.0807 1479.2225 1482.0251 1487.6063 1595.3517 1596.8863 1611.2480 2270.7542 2952.6725 2962.9368 2969.4954 2972.6691 2983.3392 2987.4856 2994.4494 2994.5708 3003.8789 3006.5827 3006.8392 3008.7450 3024.3001 3024.3769 3040.1603 3047.7029 3054.1586 3055.2050 3069.1497 3069.5648 3072.9886 3077.3385 3079.3442 3122.9571 3133.9064 3147.6089 3158.7091 3170.2351 3450.0573
redmass: 3.5468 4.3890 4.2609 4.0164 2.5040 2.6557 3.2779 3.9083 6.0311 4.3011 4.5576 1.8869 2.5497 2.8486 3.5884 3.3546 4.5084 5.2324 1.1194 3.1082 4.1296 4.2487 2.0774 4.1157 2.8581 3.4005 5.7649 2.5704 2.5534 2.6085 3.4125 1.9589 3.2983 5.1036 4.3413 4.8549 4.1894 4.3614 8.4385 4.6382 6.3859 6.3153 7.7581 1.8913 1.0688 4.6619 1.1417 3.3316 2.2493 1.5518 1.8520 2.5091 1.2348 2.0188 1.2470 2.9545 3.0459 3.5865 3.0029 2.3301 1.9314 2.0213 1.2388 3.3001 1.7968 2.5752 2.9456 4.2758 3.2843 1.5544 2.8810 2.7450 2.2100 3.2641 2.8334 2.3766 2.4107 1.6133 1.6515 1.3739 2.2806 1.3586 2.8401 1.8241 1.0547 2.2314 1.1482 1.5261 1.3956 1.4860 3.5189 1.2498 1.3199 1.2250 1.4567 1.0675 1.1008 1.2785 1.3893 1.3185 1.3039 1.3776 1.3470 1.3331 1.3900 1.3085 1.4158 1.4295 1.3902 1.6138 1.5024 9.7984 1.2142 2.2220 1.0808 1.0823 1.0782 1.0682 1.0831 1.0741 1.0834 1.0491 2.2197 1.0732 1.0896 1.0868 6.4884 10.2350 6.3749 11.8670 1.0588 1.0582 1.0584 1.0370 1.0603 1.0610 1.0969 1.0606 1.0604 1.0612 1.0994 1.0633 1.0863 1.1032 1.1030 1.0888 1.1024 1.1046 1.1055 1.1009 1.0992 1.1048 1.1053 1.0847 1.0887 1.0933 1.0970 1.0982 1.0648
irintensity: 0.1786 0.0131 0.1358 0.0641 0.1296 0.3755 0.0525 0.1432 0.8643 0.5336 0.2355 0.1785 0.3670 0.2022 0.9208 5.9183 1.4172 4.8577 0.0069 31.9154 2.1627 1.1664 36.3852 3.2334 42.7250 3.9189 2.9420 12.4747 16.8923 8.2739 6.7911 38.6306 2.2589 3.1853 6.4590 5.7064 1.3143 2.9068 20.1177 10.1202 0.1353 10.6007 19.6991 43.7445 11.6846 35.7909 0.2351 18.7456 46.6725 8.8997 10.6516 11.9992 0.9679 22.2814 0.0522 1.9152 7.6477 8.5428 7.6180 21.7021 5.3847 14.8116 1.1728 28.9413 22.6630 41.9151 31.9836 13.8423 3.9532 4.6069 45.5194 4.6592 11.9618 5.4603 40.2635 11.8786 0.1955 1.6299 0.0236 0.5332 12.7818 10.7371 84.5844 125.7994 0.2266 189.9181 8.1912 0.0444 15.6354 2.3392 33.7181 0.6063 1.8039 0.3061 4.9227 0.0149 1.1125 5.6708 8.8307 2.4485 2.5412 8.2715 1.0799 0.3332 3.3959 1.6266 46.1161 28.2015 3.0348 0.4820 4.5983 0.3185 11.0817 16.7410 12.4357 2.2302 1.5844 0.4312 12.0067 1.3624 14.9751 13.2799 16.5959 5.6718 9.4195 19.9975 0.2813 176.6259 15.0851 43.4834 12.7020 21.0662 45.8436 38.3335 32.0324 48.9476 5.8112 20.4853 85.4270 54.5440 6.4944 30.2008 8.8178 11.6547 9.3099 30.5878 1.7037 41.6711 14.2134 104.8279 50.6611 44.3888 66.8219 0.0837 10.2986 25.4590 19.8010 12.7199 43.9411
temp: 298.150 k
press: 1.00000 atm
elementType: 8 8 8 7 6 6 6 6 6 6 6 6 6 6 6 6 6 6 6 6 6 6 6 6 6 6 1 1 1 1 1 1 1 1 1 1 1 1 1 1 1 1 1 1 1 1 1 1 1 1 1 1 1 1 1
symmnumber: 1
zpe: 1215872.7 jmol-1
zpe.correction: 0.463101 hartree
zpe.thermalcorrener: 0.489545 hartree
zpe.thermalcorrenthalpy: 0.490489 hartree
zpe.thermalcorrgfe: 0.401682 hartree
zpe.sumelectzpe: -1134.120001 hartree
zpe.sumelectthermal: -1134.093558 hartree
zpe.sumelectthermalent: -1134.092614 hartree
zpe.sumelectthermalfe: -1134.181421 hartree
dipole: 0.6407 -3.7723 -2.6025
dipole: 4.6275
quadrupole: -150.8852 -149.3793 -154.3500
quadrupole: -1.3291 1.6035 -4.8137
quadrupole: 0.6530 2.1589 -2.8118 -1.3291 1.6035 -4.8137
hfenergy: -1134.5831029 hartree
pointgroup: C01 [X(C22H29N1O3)]
dipole: -0.1859852 1.4785231 -1.0459262 debye
polarizability: 268.7044284|-25.2019309|241.0425841|5.4518694|7.2336313|230.0568387 unknown
InChI: InChI=1S/C22H29NO3/c1-2-3-4-5-9-14-22(25,19-10-7-6-8-11-19)21(24)26-20-17-23-15-12-18(20)13-16-23/h6-8,10-11,18,20,25H,2-5,12-13,15-17H2,1H3
charge 0 multiplicity 1
55 atoms
O  1.334701 0.452593 0.491693
O  1.444976 -0.122342 2.747426
O  -0.507324 -1.9601 2.53866
N  4.749663 0.881798 -0.45526
C  2.552579 2.272893 -0.594612
C  2.528341 1.359413 0.645362
C  3.775345 3.221517 -0.434432
C  2.725037 1.419298 -1.881612
C  3.86244 0.534474 0.687921
C  5.079933 2.339345 -0.402443
C  4.046151 0.576858 -1.741362
C  0.920552 -0.217387 1.608611
C  -0.336079 -1.124231 1.342828
C  -0.06827 -2.058614 0.146725
C  -1.49506 -0.226066 1.150587
C  -0.504535 -1.732823 -1.1579
C  0.680697 -3.240331 0.360774
C  -2.472306 0.521099 1.054553
C  -3.656448 1.38803 0.941656
C  -4.744443 0.833897 -0.02153
C  -5.982075 1.754874 -0.087169
C  -0.190105 -2.580987 -2.243279
C  0.993794 -4.087286 -0.72497
C  -7.078096 1.22813 -1.041505
C  0.562767 -3.759165 -2.031611
C  -8.317753 2.146967 -1.096269
H  1.615537 2.854733 -0.642833
H  2.37544 1.934921 1.576935
H  3.793187 3.931443 -1.28202
H  3.677707 3.821573 0.490951
H  1.848818 0.761745 -2.015093
H  2.773664 2.094944 -2.756192
H  3.632952 -0.545496 0.638838
H  4.402453 0.722508 1.631778
H  5.734388 2.566422 -1.262604
H  5.663786 2.524619 0.517345
H  3.827046 -0.505572 -1.755734
H  4.748161 0.787105 -2.568002
H  -0.096787 -1.462306 3.300707
H  -1.091911 -0.8225 -1.318096
H  0.982397 -3.499854 1.379839
H  -3.347469 2.397039 0.600008
H  -4.100697 1.524874 1.948781
H  -5.042833 -0.177371 0.315716
H  -4.307908 0.714974 -1.032543
H  -5.672955 2.770842 -0.411966
H  -6.409803 1.870106 0.93103
H  -0.536689 -2.325682 -3.251191
H  1.567154 -5.004804 -0.55084
H  -6.652781 1.117138 -2.059773
H  -7.382656 0.211646 -0.719593
H  0.803566 -4.418121 -2.873597
H  -9.086871 1.748188 -1.782857
H  -8.778872 2.250425 -0.095843
H  -8.045403 3.160804 -1.446094
