program: Orca
programVersion: 5.0.2
elementType: Cl F F F F O O O O O O N N N C C C C C C C C C C C C C C C C C C C C C H H H H H H H H H H H H H H H H
charge: 0
multiplicity: 1
keywords: wb97x-d3
keywords: def2-TZVPP
keywords: def2/J RIJCOSX
keywords: DEFGRID2
keywords: scfconv7
keywords: smallprint printgap noloewdin
keywords: NOSOSCF
formula: C21H16ClF4N3O6
InChI: InChI=1/C21H16ClF4N3O6/c1-3-33-18(31)10-34-19-14(5-4-6-27-19)35-15-8-13(12(23)7-11(15)22)29-17(30)9-16(21(24,25)26)28(2)20(29)32/h4-9H,3,10H2,1-2H3
51 atoms
Cl 4.994643 -2.21952 -0.502892
F  0.191962 -3.610793 -1.079427
F  -5.62608 -1.731639 0.530248
F  -5.223312 0.129669 1.552012
F  -5.384837 0.083455 -0.58387
O  3.786053 0.037599 0.792372
O  -0.819033 -2.230257 2.220403
O  -0.790069 -0.474785 -1.960926
O  2.394951 1.604967 -1.000459
O  -0.664114 3.11351 -2.003692
O  -0.189038 2.005138 -0.108016
N  -0.802631 -1.357971 0.135005
N  -2.796448 -1.468105 1.389269
N  2.546279 3.425353 0.385423
C  0.595733 -1.597208 0.047151
C  -3.448309 -0.857749 0.346468
C  -1.427104 -1.72423 1.315124
C  -1.410709 -0.753578 -0.964814
C  -2.825391 -0.508324 -0.786893
C  1.489559 -0.672777 0.550499
C  1.064004 -2.724813 -0.597231
C  -3.443958 -1.821565 2.652163
C  2.849593 -0.845281 0.366003
C  -4.934173 -0.591526 0.467647
C  2.416174 -2.938014 -0.756944
C  3.307014 -1.989374 -0.281895
C  3.464127 1.332453 1.061347
C  2.787882 2.161829 0.148176
C  3.88763 1.892583 2.245485
C  3.639662 3.239876 2.489845
C  1.500325 2.316534 -1.810116
C  2.962102 3.959998 1.529031
C  0.129181 2.447323 -1.175567
C  -2.064502 3.207355 -1.724831
C  -2.834722 2.683213 -2.91632
H  -3.348447 -0.044893 -1.606324
H  1.102677 0.200412 1.05655
H  -4.384001 -2.335761 2.481024
H  -2.786626 -2.495099 3.188467
H  -3.610218 -0.942016 3.271196
H  2.774222 -3.82339 -1.262767
H  4.414575 1.277753 2.963473
H  3.962268 3.707637 3.408609
H  1.877597 3.30768 -2.074797
H  1.399965 1.730617 -2.724728
H  2.742018 5.010865 1.671971
H  -2.289233 4.259803 -1.542007
H  -2.309415 2.651355 -0.819855
H  -3.905755 2.748197 -2.721741
H  -2.624352 3.258578 -3.817208
H  -2.582814 1.641301 -3.114682
totalener: -2285.29272479 hartree
nucrepener: 4263.74269964 hartree
electener: -6549.03542443 hartree
twoeener: 5077.54477556 hartree
kineticenergy: 2277.84374372 hartree
xcener: -184.625634358616 hartree
chargesum: -0.0000000
charge: -0.051967 -0.202831 -0.157284 -0.158049 -0.156016 -0.298869 -0.371191 -0.373442 -0.272764 -0.272599 -0.390483 -0.066444 -0.127051 -0.344533 0.093369 0.000523 0.352947 0.273608 -0.188149 -0.161196 0.205957 -0.210039 0.270334 0.534345 -0.138458 0.004697 0.118835 0.356468 -0.135345 -0.124969 0.013373 -0.005548 0.380458 0.019670 -0.248621 0.139310 0.130718 0.123534 0.126278 0.127070 0.111351 0.131933 0.124052 0.120704 0.132208 0.113558 0.099060 0.089000 0.087909 0.095437 0.079142
qa: -0.0520 -0.2028 -0.1573 -0.1580 -0.1560 -0.2989 -0.3712 -0.3734 -0.2728 -0.2726 -0.3905 -0.0664 -0.1271 -0.3445 0.0934 0.0005 0.3529 0.2736 -0.1881 -0.1612 0.2060 -0.2100 0.2703 0.5343 -0.1385 0.0047 0.1188 0.3565 -0.1353 -0.1250 0.0134 -0.0055 0.3805 0.0197 -0.2486 0.1393 0.1307 0.1235 0.1263 0.1271 0.1114 0.1319 0.1241 0.1207 0.1322 0.1136 0.0991 0.0890 0.0879 0.0954 0.0791
va: 1.2628 1.0958 1.1529 1.1512 1.1521 2.1382 2.1445 2.1261 2.1354 2.1396 2.0878 3.1044 3.3218 3.0085 3.5151 4.0044 4.2675 4.2441 3.8123 4.0569 4.1918 3.8579 3.8979 4.4188 3.9975 3.9222 3.9147 3.9916 3.9916 3.8782 3.8619 4.0844 4.1157 3.8562 3.9234 1.0155 1.0342 1.0030 1.0240 0.9901 1.0254 1.0097 1.0021 1.0218 1.0057 1.0011 0.9962 1.0182 1.0074 1.0094 1.0227
dispcorr: -0.032877701 hartree
energy: -2285.325602488360
dipole: -0.76589 -0.49220 -1.25809 26.85481 -25.85677 0.99804 -1.44427 1.91376 0.46949
magnitude: 1.67311 au
magnitude: 4.25270 debye
