program: Orca
programVersion: 5.0.2
elementType: Cl F F F F O O O O O O N N N C C C C C C C C C C C C C C C C C C C C C H H H H H H H H H H H H H H H H
charge: 0
multiplicity: 1
keywords: wb97x-d3
keywords: def2-TZVPP
keywords: def2/J RIJCOSX
keywords: DEFGRID2
keywords: scfconv7
keywords: smallprint printgap noloewdin
keywords: NOSOSCF
formula: C21H16ClF4N3O6
InChI: InChI=1/C21H16ClF4N3O6/c1-3-33-18(31)10-34-19-14(5-4-6-27-19)35-15-8-13(12(23)7-11(15)22)29-17(30)9-16(21(24,25)26)28(2)20(29)32/h4-9H,3,10H2,1-2H3
51 atoms
Cl 5.046091 -2.246873 -0.440801
F  0.270262 -3.756914 -0.939371
F  -5.618212 -1.687903 0.439516
F  -5.159258 0.157622 1.464856
F  -5.277091 0.11341 -0.673259
O  3.790569 0.054145 0.72972
O  -0.838828 -2.253303 2.279527
O  -0.689424 -0.658077 -1.96092
O  2.234901 1.475244 -1.084562
O  -0.903355 2.98796 -1.832013
O  -0.277768 1.878046 0.004427
N  -0.763249 -1.463704 0.163583
N  -2.785873 -1.49907 1.372318
N  2.419006 3.375617 0.179941
C  0.63762 -1.698182 0.113621
C  -3.401976 -0.904949 0.298992
C  -1.418132 -1.774244 1.341544
C  -1.337873 -0.893115 -0.971394
C  -2.750472 -0.615028 -0.835296
C  1.514057 -0.73649 0.575221
C  1.126698 -2.841415 -0.485844
C  -3.469328 -1.819284 2.625032
C  2.874962 -0.8813 0.376648
C  -4.877789 -0.578457 0.388552
C  2.482791 -3.035697 -0.638489
C  3.354959 -2.04576 -0.215907
C  3.43767 1.354371 0.925486
C  2.685259 2.106534 0.003789
C  3.906051 2.001821 2.047463
C  3.631233 3.354065 2.224131
C  1.254702 2.116447 -1.855544
C  2.880266 3.994007 1.261387
C  -0.04363 2.302127 -1.093363
C  -2.204031 3.225021 -1.283174
C  -3.068141 3.815703 -2.371064
H  -3.242407 -0.166559 -1.682215
H  1.110861 0.148731 1.046137
H  -2.861839 -2.533685 3.166855
H  -3.592156 -0.934991 3.247305
H  -4.435396 -2.275073 2.437892
H  2.85765 -3.935453 -1.10541
H  4.488683 1.447693 2.771705
H  3.988855 3.886208 3.093646
H  1.595314 3.081912 -2.237908
H  1.06608 1.455362 -2.702342
H  2.635197 5.045294 1.35128
H  -2.119015 3.904615 -0.431762
H  -2.629092 2.290162 -0.911553
H  -3.18088 3.127116 -3.20841
H  -4.061266 4.02315 -1.972765
H  -2.658018 4.7514 -2.749602
totalener: -2285.29338424 hartree
nucrepener: 4267.57473970 hartree
electener: -6552.86812395 hartree
twoeener: 5081.33702778 hartree
kineticenergy: 2277.84709191 hartree
xcener: -184.625912819203 hartree
chargesum: -0.0000000
charge: -0.052384 -0.202575 -0.156935 -0.159969 -0.157645 -0.298161 -0.370265 -0.371247 -0.270249 -0.267909 -0.393088 -0.064697 -0.128753 -0.345979 0.098325 0.018706 0.353449 0.256995 -0.199050 -0.178857 0.206119 -0.207087 0.277857 0.540887 -0.135588 -0.000371 0.122978 0.354060 -0.138337 -0.124204 0.022732 -0.005179 0.359600 0.035409 -0.229415 0.138919 0.137593 0.125119 0.127231 0.122390 0.111115 0.131498 0.124236 0.123396 0.136673 0.113429 0.098379 0.067710 0.085462 0.079457 0.088222
qa: -0.0524 -0.2026 -0.1569 -0.1600 -0.1576 -0.2982 -0.3703 -0.3712 -0.2702 -0.2679 -0.3931 -0.0647 -0.1288 -0.3460 0.0983 0.0187 0.3534 0.2570 -0.1991 -0.1789 0.2061 -0.2071 0.2779 0.5409 -0.1356 -0.0004 0.1230 0.3541 -0.1383 -0.1242 0.0227 -0.0052 0.3596 0.0354 -0.2294 0.1389 0.1376 0.1251 0.1272 0.1224 0.1111 0.1315 0.1242 0.1234 0.1367 0.1134 0.0984 0.0677 0.0855 0.0795 0.0882
va: 1.2622 1.0961 1.1537 1.1490 1.1498 2.1402 2.1449 2.1287 2.1329 2.1496 2.0730 3.0967 3.3235 3.0075 3.5135 3.9418 4.2733 4.2524 3.8115 4.0605 4.1943 3.8631 3.8873 4.4098 3.9929 3.9241 3.9180 3.9905 3.9908 3.8796 3.8545 4.0808 4.1179 3.8840 3.9570 1.0195 1.0333 1.0218 0.9897 1.0040 1.0251 1.0100 1.0020 1.0216 1.0074 1.0010 1.0000 0.9962 1.0059 1.0083 1.0063
dispcorr: -0.032610845 hartree
energy: -2285.325995088812
dipole: -2.30075 0.96857 -1.33217 30.03901 -28.87852 1.16049 0.14757 0.34598 0.49356
magnitude: 1.83440 au
magnitude: 4.66267 debye
