program: Orca
programVersion: 5.0.2
elementType: Cl Cl O O O O N C C C C C C C C C C C C C C C C C C C H H H H H H H H H H H H H H H H H
charge: 0
multiplicity: 1
keywords: wb97x-d3
keywords: def2-TZVPP
keywords: def2/J RIJCOSX
keywords: DEFGRID2
keywords: scfconv7
keywords: smallprint printgap noloewdin
keywords: NOSOSCF
formula: C19H17Cl2NO4
InChI: InChI=1/C19H17Cl2NO4/c1-2-26-19(25)16(21)10-11-9-12(7-8-15(11)20)22-17(23)13-5-3-4-6-14(13)18(22)24/h7-10H,2-6H2,1H3
43 atoms
Cl -2.580945 3.69097 0.725708
Cl -2.048738 -1.552212 1.010074
O  3.500096 1.775336 -1.492998
O  1.818277 -1.168859 1.53516
O  -4.650699 -2.051826 0.105864
O  -5.203559 -0.013411 -0.634708
N  2.319631 0.498854 0.022829
C  6.339281 -1.741452 -0.92359
C  6.133203 -2.197696 0.519984
C  5.760526 -0.347236 -1.171229
C  4.65023 -2.298879 0.87992
C  4.427638 -0.244891 -0.529812
C  3.935532 -1.108327 0.359422
C  3.419965 0.817804 -0.765732
C  2.575863 -0.662886 0.746477
C  1.151442 1.274626 0.156268
C  -0.079559 0.694111 -0.098296
C  1.233472 2.598251 0.56663
C  -1.260362 1.411852 0.083981
C  0.07565 3.340723 0.713761
C  -1.153283 2.747971 0.480875
C  -2.572635 0.822594 -0.166297
C  -3.004361 -0.398203 0.157385
C  -4.403728 -0.793815 -0.173276
C  -5.980115 -2.563781 -0.123044
C  -6.22399 -2.904737 -1.573566
H  5.684813 -0.140013 -2.241029
H  6.417839 0.425129 -0.759701
H  4.514699 -2.380427 1.960726
H  4.206596 -3.202636 0.450445
H  7.401742 -1.743062 -1.168942
H  5.859414 -2.454477 -1.599501
H  6.613539 -3.163527 0.679782
H  6.618985 -1.489427 1.19681
H  -0.119762 -0.319082 -0.471047
H  2.190769 3.051926 0.784839
H  0.133428 4.372883 1.029736
H  -3.300118 1.45725 -0.658992
H  -6.028134 -3.458341 0.494082
H  -6.718252 -1.855025 0.254227
H  -6.232645 -2.024823 -2.214899
H  -5.477502 -3.604405 -1.949052
H  -7.199507 -3.384572 -1.656958
elementType: Cl O N C H
totalener: -2010.47577236 hartree
nucrepener: 2536.69450745 hartree
electener: -4547.17027981 hartree
oneelecener: -7800.32765680 hartree
twoeener: 3253.15737699 hartree
cpcmener: -0.03951151 hartree
kineticenergy: 2004.61014106 hartree
xcener: -146.369206145619 hartree
chargesum: 0.0000000
charge: -0.070981 -0.068548 -0.431660 -0.433086 -0.275726 -0.477577 -0.053170 -0.136172 -0.135098 -0.073501 -0.072351 -0.084490 -0.059690 0.349044 0.335293 0.091402 -0.195484 -0.191120 0.097724 -0.128142 0.049431 -0.071204 -0.056807 0.495136 0.040488 -0.251862 0.094761 0.102172 0.093520 0.101336 0.081128 0.078964 0.081065 0.078529 0.166203 0.163061 0.143881 0.136477 0.113673 0.096584 0.088955 0.089216 0.098622
qa: -0.0710 -0.0685 -0.4317 -0.4331 -0.2757 -0.4776 -0.0532 -0.1362 -0.1351 -0.0735 -0.0724 -0.0845 -0.0597 0.3490 0.3353 0.0914 -0.1955 -0.1911 0.0977 -0.1281 0.0494 -0.0712 -0.0568 0.4951 0.0405 -0.2519 0.0948 0.1022 0.0935 0.1013 0.0811 0.0790 0.0811 0.0785 0.1662 0.1631 0.1439 0.1365 0.1137 0.0966 0.0890 0.0892 0.0986
va: 1.2575 1.2633 2.0807 2.0786 2.1689 2.0265 3.0914 3.9166 3.9154 3.9172 3.9187 3.7122 3.7074 4.1647 4.1625 3.7332 4.0459 4.0672 3.6708 4.0015 3.9656 3.8598 3.9991 4.1525 3.8425 3.9165 1.0146 1.0045 1.0153 1.0044 1.0091 1.0066 1.0091 1.0068 1.0142 1.0011 1.0072 1.0389 0.9955 1.0086 1.0144 1.0045 1.0059
dispcorr: -0.021070488 hartree
energy: -2010.496842844032
dipole: 20.13171 -18.08164 2.05007 -22.27215 20.74373 -1.52842 -9.12225 8.97680 -0.14545
magnitude: 2.56125 au
magnitude: 6.51019 debye
