program: Orca
programVersion: 5.0.2
elementType: Cl Cl O O O O N C C C C C C C C C C C C C C C C C C C H H H H H H H H H H H H H H H H H
charge: 0
multiplicity: 1
keywords: wb97x-d3
keywords: def2-TZVPP
keywords: def2/J RIJCOSX
keywords: DEFGRID2
keywords: scfconv7
keywords: smallprint printgap noloewdin
keywords: NOSOSCF
formula: C19H17Cl2NO4
InChI: InChI=1/C19H17Cl2NO4/c1-2-26-19(25)16(21)10-11-9-12(7-8-15(11)20)22-17(23)13-5-3-4-6-14(13)18(22)24/h7-10H,2-6H2,1H3
43 atoms
Cl -2.665173 3.493077 -0.542951
Cl -2.019729 -1.605251 -0.891268
O  3.593574 1.885406 1.391438
O  1.821682 -1.319963 -1.305428
O  -4.578991 -2.206985 0.068938
O  -5.015772 -0.342331 1.228472
N  2.363117 0.476611 0.039596
C  6.728288 -1.226428 0.304073
C  5.969298 -2.540105 0.125832
C  5.89963 -0.188584 1.063133
C  4.691754 -2.356236 -0.69491
C  4.518182 -0.178414 0.524475
C  3.992889 -1.12538 -0.253594
C  3.497444 0.87569 0.740735
C  2.606314 -0.735553 -0.601791
C  1.166534 1.211682 -0.0707
C  -0.034116 0.61003 0.269004
C  1.188302 2.51905 -0.538305
C  -1.239958 1.29104 0.120147
C  0.00385 3.224432 -0.655874
C  -1.194482 2.609696 -0.334948
C  -2.517569 0.668964 0.463495
C  -2.939605 -0.546444 0.110786
C  -4.290337 -1.013392 0.533061
C  -5.884351 -2.757344 0.339725
C  -6.918085 -2.235266 -0.629833
H  6.346857 0.804348 0.983846
H  5.869821 -0.423042 2.131481
H  4.034372 -3.222472 -0.594014
H  4.922919 -2.275285 -1.761495
H  7.664788 -1.40407 0.833775
H  6.992677 -0.824706 -0.677929
H  6.608423 -3.279456 -0.357856
H  5.710626 -2.943489 1.108537
H  -0.033771 -0.389653 0.679345
H  2.119281 2.989098 -0.824132
H  0.01598 4.243526 -1.016434
H  -3.209051 1.263124 1.050302
H  -5.752117 -3.831015 0.22342
H  -6.165709 -2.562027 1.374794
H  -7.866313 -2.736698 -0.435378
H  -7.082682 -1.163702 -0.522977
H  -6.636576 -2.444303 -1.66172
elementType: Cl O N C H
totalener: -2010.47606372 hartree
nucrepener: 2538.85899293 hartree
electener: -4549.33505665 hartree
oneelecener: -7804.69841737 hartree
twoeener: 3255.36336072 hartree
cpcmener: -0.03934308 hartree
kineticenergy: 2004.61379359 hartree
xcener: -146.369560058207 hartree
chargesum: -0.0000000
charge: -0.070700 -0.067891 -0.431367 -0.433138 -0.275220 -0.475581 -0.053196 -0.134383 -0.135231 -0.074347 -0.073203 -0.082248 -0.061000 0.349278 0.333910 0.107860 -0.203134 -0.194307 0.090918 -0.130279 0.048511 -0.073437 -0.058427 0.491786 0.040801 -0.250156 0.092640 0.102404 0.094223 0.102445 0.080921 0.078671 0.081101 0.078929 0.166282 0.162639 0.144304 0.144332 0.113076 0.095078 0.097557 0.089448 0.090131
qa: -0.0707 -0.0679 -0.4314 -0.4331 -0.2752 -0.4756 -0.0532 -0.1344 -0.1352 -0.0743 -0.0732 -0.0822 -0.0610 0.3493 0.3339 0.1079 -0.2031 -0.1943 0.0909 -0.1303 0.0485 -0.0734 -0.0584 0.4918 0.0408 -0.2502 0.0926 0.1024 0.0942 0.1024 0.0809 0.0787 0.0811 0.0789 0.1663 0.1626 0.1443 0.1443 0.1131 0.0951 0.0976 0.0894 0.0901
va: 1.2580 1.2635 2.0809 2.0782 2.1702 2.0295 3.0966 3.9150 3.9162 3.9182 3.9187 3.7112 3.7106 4.1600 4.1631 3.7120 4.0367 4.0600 3.6716 4.0056 3.9558 3.8602 3.9954 4.1610 3.8417 3.9220 1.0159 1.0044 1.0150 1.0049 1.0093 1.0066 1.0092 1.0065 1.0120 1.0019 1.0070 1.0331 0.9952 1.0100 1.0065 1.0117 1.0043
dispcorr: -0.021185078 hartree
energy: -2010.497248794127
dipole: 19.04720 -17.07490 1.97230 -19.66186 18.29043 -1.37143 3.04937 -3.22748 -0.17811
magnitude: 2.40884 au
magnitude: 6.12278 debye
