program: Orca
programVersion: 5.0.2
elementType: Cl Cl O O O O N C C C C C C C C C C C C C C C C C C C H H H H H H H H H H H H H H H H H
charge: 0
multiplicity: 1
keywords: wb97x-d3
keywords: def2-TZVPP
keywords: def2/J RIJCOSX
keywords: DEFGRID2
keywords: scfconv7
keywords: smallprint printgap noloewdin
keywords: NOSOSCF
formula: C19H17Cl2NO4
InChI: InChI=1/C19H17Cl2NO4/c1-2-26-19(25)16(21)10-11-9-12(7-8-15(11)20)22-17(23)13-5-3-4-6-14(13)18(22)24/h7-10H,2-6H2,1H3
43 atoms
Cl -2.6492 2.961003 -0.241128
Cl -3.235135 0.185136 1.650765
O  3.395992 0.95158 1.879003
O  2.547197 -0.706387 -2.270111
O  -5.177559 -1.507295 0.498325
O  -4.457902 -1.523101 -1.617294
N  2.610451 0.292149 -0.189118
C  6.770527 -1.775005 0.51673
C  6.811438 -1.650361 -1.005448
C  5.973862 -0.639137 1.160413
C  5.413758 -1.729818 -1.621867
C  4.726099 -0.416327 0.391532
C  4.475981 -0.904683 -0.82332
C  3.548604 0.36535 0.83771
C  3.12036 -0.471339 -1.23679
C  1.349239 0.91936 -0.181366
C  0.20892 0.183518 -0.465786
C  1.24922 2.276066 0.101253
C  -1.044777 0.787762 -0.473722
C  0.008801 2.88706 0.104332
C  -1.126836 2.148531 -0.187561
C  -2.217936 -0.028706 -0.813085
C  -3.213137 -0.340821 0.012596
C  -4.346301 -1.182758 -0.462576
C  -6.313045 -2.32901 0.158773
C  -7.085579 -2.587027 1.424946
H  6.558458 0.285975 1.173308
H  5.742805 -0.86458 2.203764
H  5.056227 -2.763988 -1.641207
H  5.424763 -1.394806 -2.66123
H  6.315596 -2.731294 0.788722
H  7.783803 -1.783788 0.919221
H  7.269816 -0.695858 -1.27769
H  7.441601 -2.433059 -1.428787
H  0.277605 -0.87691 -0.669597
H  2.131909 2.867877 0.29959
H  -0.069024 3.944256 0.316523
H  -2.250123 -0.442593 -1.81497
H  -6.92635 -1.807204 -0.577283
H  -5.963607 -3.261927 -0.285558
H  -7.444438 -1.662344 1.875329
H  -7.953823 -3.201065 1.188221
H  -6.487202 -3.125572 2.159006
elementType: Cl O N C H
totalener: -2010.47499747 hartree
nucrepener: 2517.51253435 hartree
electener: -4527.98753182 hartree
oneelecener: -7761.87734184 hartree
twoeener: 3233.88981002 hartree
cpcmener: -0.03980074 hartree
kineticenergy: 2004.62613874 hartree
xcener: -146.370419250737 hartree
chargesum: -0.0000000
charge: -0.068939 -0.062829 -0.430464 -0.431132 -0.270884 -0.475988 -0.051469 -0.135380 -0.135685 -0.074191 -0.074660 -0.076061 -0.070386 0.345512 0.342946 0.116869 -0.151177 -0.206094 -0.001355 -0.124600 0.047799 -0.028072 -0.051183 0.484184 0.037419 -0.249810 0.101938 0.093712 0.102420 0.094168 0.078940 0.080531 0.078831 0.081796 0.149469 0.160625 0.144725 0.149705 0.105789 0.103418 0.089140 0.090836 0.089587
qa: -0.0689 -0.0628 -0.4305 -0.4311 -0.2709 -0.4760 -0.0515 -0.1354 -0.1357 -0.0742 -0.0747 -0.0761 -0.0704 0.3455 0.3429 0.1169 -0.1512 -0.2061 -0.0014 -0.1246 0.0478 -0.0281 -0.0512 0.4842 0.0374 -0.2498 0.1019 0.0937 0.1024 0.0942 0.0789 0.0805 0.0788 0.0818 0.1495 0.1606 0.1447 0.1497 0.1058 0.1034 0.0891 0.0908 0.0896
va: 1.2546 1.2642 2.0816 2.0805 2.1722 2.0341 3.1123 3.9162 3.9155 3.9180 3.9187 3.7055 3.7044 4.1641 4.1644 3.6823 3.9990 4.0392 3.8094 4.0072 3.8805 3.7962 3.9983 4.1476 3.8322 3.9738 1.0043 1.0152 1.0043 1.0153 1.0065 1.0093 1.0066 1.0092 1.0162 1.0047 1.0067 1.0214 0.9953 0.9956 1.0032 1.0064 1.0030
dispcorr: -0.020645746 hartree
energy: -2010.495643211244
dipole: 23.52337 -21.59829 1.92509 -22.87691 21.76996 -1.10695 -1.14483 1.52333 0.37850
magnitude: 2.25268 au
magnitude: 5.72586 debye
