program: Orca
programVersion: 5.0.2
elementType: Cl Cl O O O O N C C C C C C C C C C C C C C C C C C C H H H H H H H H H H H H H H H H H
charge: 0
multiplicity: 1
keywords: wb97x-d3
keywords: def2-TZVPP
keywords: def2/J RIJCOSX
keywords: DEFGRID2
keywords: scfconv7
keywords: smallprint printgap noloewdin
keywords: NOSOSCF
formula: C19H17Cl2NO4
InChI: InChI=1/C19H17Cl2NO4/c1-2-26-19(25)16(21)10-11-9-12(7-8-15(11)20)22-17(23)13-5-3-4-6-14(13)18(22)24/h7-10H,2-6H2,1H3
43 atoms
Cl -2.681899 2.793261 -0.697111
Cl -3.424772 -0.393561 -1.476333
O  2.58973 -0.119987 2.150349
O  3.433188 0.431036 -2.288831
O  -5.300625 -1.419782 0.370852
O  -4.15474 -1.136319 2.267136
N  2.638353 0.307352 -0.121783
C  6.597721 -1.951323 1.021602
C  7.134314 -1.046533 -0.086356
C  5.434571 -1.301605 1.77286
C  6.074485 -0.761949 -1.152957
C  4.515815 -0.665934 0.798709
C  4.784589 -0.454435 -0.489427
C  3.1554 -0.157128 1.087135
C  3.589399 0.145347 -1.128723
C  1.363513 0.88284 -0.285897
C  0.251018 0.256953 0.255126
C  1.218672 2.086196 -0.966132
C  -1.016225 0.8199 0.134228
C  -0.037605 2.644457 -1.113357
C  -1.145033 2.019003 -0.562043
C  -2.136491 0.149599 0.805747
C  -3.207235 -0.38937 0.229485
C  -4.263541 -1.022494 1.068614
C  -6.393006 -2.032056 1.087473
C  -7.460483 -2.384309 0.085481
H  5.796711 -0.54828 2.479141
H  4.895063 -2.040554 2.370285
H  5.951303 -1.620756 -1.819592
H  6.377198 0.073821 -1.78841
H  6.260989 -2.895668 0.58518
H  7.39378 -2.196925 1.725031
H  7.467032 -0.100823 0.350609
H  8.008313 -1.501592 -0.553137
H  0.350427 -0.686531 0.77435
H  2.078581 2.607131 -1.362662
H  -0.148918 3.58392 -1.636444
H  -2.056748 0.057879 1.883232
H  -6.029958 -2.921436 1.605141
H  -6.770707 -1.331427 1.833883
H  -7.099213 -3.095016 -0.657581
H  -8.295353 -2.847476 0.610433
H  -7.839188 -1.500961 -0.428459
elementType: Cl O N C H
totalener: -2010.47456247 hartree
nucrepener: 2514.70443346 hartree
electener: -4525.17899592 hartree
oneelecener: -7756.26263387 hartree
twoeener: 3231.08363794 hartree
cpcmener: -0.03908050 hartree
kineticenergy: 2004.61989565 hartree
xcener: -146.369759269914 hartree
chargesum: -0.0000000
charge: -0.068829 -0.061968 -0.430762 -0.429640 -0.271271 -0.476153 -0.051515 -0.135565 -0.134353 -0.074183 -0.074444 -0.062415 -0.079292 0.336964 0.344938 0.116989 -0.148359 -0.198248 -0.006243 -0.132912 0.052616 -0.030710 -0.049110 0.485512 0.036328 -0.249598 0.102167 0.095078 0.102384 0.094822 0.078934 0.081148 0.078591 0.080583 0.147100 0.159213 0.144240 0.148834 0.105890 0.103852 0.088896 0.090994 0.089496
qa: -0.0688 -0.0620 -0.4308 -0.4296 -0.2713 -0.4762 -0.0515 -0.1356 -0.1344 -0.0742 -0.0744 -0.0624 -0.0793 0.3370 0.3449 0.1170 -0.1484 -0.1982 -0.0062 -0.1329 0.0526 -0.0307 -0.0491 0.4855 0.0363 -0.2496 0.1022 0.0951 0.1024 0.0948 0.0789 0.0811 0.0786 0.0806 0.1471 0.1592 0.1442 0.1488 0.1059 0.1039 0.0889 0.0910 0.0895
va: 1.2551 1.2652 2.0795 2.0811 2.1732 2.0339 3.1241 3.9155 3.9146 3.9194 3.9189 3.7081 3.7145 4.1619 4.1619 3.6992 3.9855 4.0306 3.8110 4.0190 3.8810 3.7903 4.0072 4.1457 3.8324 3.9740 1.0055 1.0144 1.0053 1.0145 1.0066 1.0092 1.0067 1.0093 1.0185 1.0061 1.0073 1.0234 0.9951 0.9954 1.0032 1.0062 1.0029
dispcorr: -0.020553750 hartree
energy: -2010.495116214843
dipole: 23.36318 -21.53945 1.82373 -19.11330 18.19064 -0.92266 8.62249 -8.61940 0.00309
magnitude: 2.04385 au
magnitude: 5.19504 debye
