program: Orca
programVersion: 5.0.2
elementType: Cl Cl O O O O N C C C C C C C C C C C C C C C C C C C H H H H H H H H H H H H H H H H H
charge: 0
multiplicity: 1
keywords: wb97x-d3
keywords: def2-TZVPP
keywords: def2/J RIJCOSX
keywords: DEFGRID2
keywords: scfconv7
keywords: smallprint printgap noloewdin
keywords: NOSOSCF
formula: C19H17Cl2NO4
InChI: InChI=1/C19H17Cl2NO4/c1-2-26-19(25)16(21)10-11-9-12(7-8-15(11)20)22-17(23)13-5-3-4-6-14(13)18(22)24/h7-10H,2-6H2,1H3
43 atoms
Cl -2.68529 2.820143 -0.490773
Cl -3.293515 0.358728 1.64016
O  2.275688 -1.355758 1.39245
O  3.703441 1.579401 -1.773879
O  -5.284047 -1.340019 0.621945
O  -4.278147 -2.040111 -1.247941
N  2.630736 0.283401 -0.193307
C  6.567976 -2.263525 0.152956
C  7.172685 -0.904661 -0.195754
C  5.260015 -2.127749 0.935744
C  6.243994 -0.079984 -1.088393
C  4.430819 -1.057894 0.330288
C  4.857937 -0.173162 -0.570783
C  3.000504 -0.78843 0.615061
C  3.720672 0.695082 -0.955751
C  1.352477 0.875059 -0.230478
C  0.233394 0.096175 -0.477059
C  1.216337 2.242111 -0.02494
C  -1.039701 0.661415 -0.497267
C  -0.034472 2.826429 -0.102179
C  -1.15251 2.041492 -0.337999
C  -2.185476 -0.226291 -0.7265
C  -3.20152 -0.42442 0.110681
C  -4.303911 -1.360108 -0.248896
C  -6.434553 -2.174291 0.373002
C  -7.463114 -1.860866 1.427426
H  5.45639 -1.886421 1.984802
H  4.710983 -3.072044 0.941263
H  6.273529 -0.441248 -2.12082
H  6.563083 0.964071 -1.124687
H  6.378412 -2.820328 -0.768669
H  7.279691 -2.85164 0.732988
H  7.372702 -0.349798 0.724847
H  8.132523 -1.040368 -0.69494
H  0.335323 -0.966212 -0.657032
H  2.078063 2.858448 0.191359
H  -0.1374 3.894676 0.028129
H  -2.173186 -0.808984 -1.640831
H  -6.822657 -1.969039 -0.625247
H  -6.131047 -3.22128 0.414562
H  -8.339491 -2.486542 1.262046
H  -7.091144 -2.066431 2.430427
H  -7.783521 -0.820814 1.378993
elementType: Cl O N C H
totalener: -2010.47450180 hartree
nucrepener: 2519.00058874 hartree
electener: -4529.47509053 hartree
oneelecener: -7764.96020715 hartree
twoeener: 3235.48511661 hartree
cpcmener: -0.04048537 hartree
kineticenergy: 2004.62277456 hartree
xcener: -146.369811036275 hartree
chargesum: -0.0000000
charge: -0.067292 -0.062750 -0.432200 -0.431225 -0.269903 -0.476113 -0.054019 -0.135610 -0.134600 -0.072948 -0.075283 -0.070636 -0.073309 0.342232 0.344367 0.115847 -0.170060 -0.216831 0.025020 -0.111779 0.038009 -0.023503 -0.055951 0.484182 0.035506 -0.249260 0.102425 0.094743 0.102705 0.093690 0.078471 0.080830 0.078483 0.080808 0.152554 0.161293 0.144598 0.147925 0.101395 0.108397 0.090843 0.089887 0.089063
qa: -0.0673 -0.0628 -0.4322 -0.4312 -0.2699 -0.4761 -0.0540 -0.1356 -0.1346 -0.0729 -0.0753 -0.0706 -0.0733 0.3422 0.3444 0.1158 -0.1701 -0.2168 0.0250 -0.1118 0.0380 -0.0235 -0.0560 0.4842 0.0355 -0.2493 0.1024 0.0947 0.1027 0.0937 0.0785 0.0808 0.0785 0.0808 0.1526 0.1613 0.1446 0.1479 0.1014 0.1084 0.0908 0.0899 0.0891
va: 1.2561 1.2657 2.0792 2.0810 2.1714 2.0341 3.0982 3.9166 3.9160 3.9180 3.9180 3.7144 3.7089 4.1605 4.1593 3.6815 4.0331 4.0555 3.7698 3.9908 3.8927 3.7968 4.0063 4.1462 3.8339 3.9728 1.0049 1.0146 1.0049 1.0153 1.0065 1.0092 1.0067 1.0096 1.0135 1.0037 1.0063 1.0235 0.9968 0.9941 1.0065 1.0029 1.0034
dispcorr: -0.020613535 hartree
energy: -2010.495115330975
dipole: 22.99544 -21.20487 1.79056 -20.36871 19.62999 -0.73872 0.53516 -0.11209 0.42308
magnitude: 1.98263 au
magnitude: 5.03944 debye
