program: Orca
programVersion: 5.0.2
elementType: Cl Cl O O O O N C C C C C C C C C C C C C C C C C C C H H H H H H H H H H H H H H H H H
charge: 0
multiplicity: 1
keywords: wb97x-d3
keywords: def2-TZVPP
keywords: def2/J RIJCOSX
keywords: DEFGRID2
keywords: scfconv7
keywords: smallprint printgap noloewdin
keywords: NOSOSCF
formula: C19H17Cl2NO4
InChI: InChI=1/C19H17Cl2NO4/c1-2-26-19(25)16(21)10-11-9-12(7-8-15(11)20)22-17(23)13-5-3-4-6-14(13)18(22)24/h7-10H,2-6H2,1H3
43 atoms
Cl -2.654016 2.921438 0.154263
Cl -3.29434 0.104285 -1.517766
O  3.842371 1.968343 1.05215
O  2.127107 -1.745497 -0.94032
O  -5.255861 -1.41517 -0.207082
O  -4.289878 -1.660644 1.794017
N  2.621814 0.286131 0.043073
C  7.031211 -1.244354 0.679673
C  6.638253 -2.100233 -0.52478
C  6.300898 0.099682 0.700981
C  5.141323 -2.416995 -0.553193
C  4.876278 -0.099493 0.343744
C  4.367814 -1.19961 -0.21034
C  3.781044 0.877994 0.543332
C  2.917269 -0.989955 -0.433613
C  1.350417 0.892592 0.033833
C  0.243423 0.198034 0.49812
C  1.205783 2.192726 -0.436349
C  -1.022016 0.777775 0.476456
C  -0.033287 2.804768 -0.394097
C  -1.137153 2.102765 0.061463
C  -2.166731 -0.034369 0.906438
C  -3.194856 -0.376948 0.132804
C  -4.298195 -1.221207 0.668083
C  -6.383198 -2.222491 0.188046
C  -7.358249 -2.233301 -0.959743
H  6.749991 0.797129 -0.013608
H  6.386894 0.576324 1.679992
H  4.8977 -3.206595 0.164834
H  4.842122 -2.798132 -1.531965
H  6.809507 -1.789314 1.600991
H  8.10765 -1.069917 0.671322
H  6.911915 -1.577743 -1.445242
H  7.204185 -3.032346 -0.513603
H  0.346555 -0.808624 0.881122
H  2.051123 2.736435 -0.833729
H  -0.139382 3.827597 -0.727803
H  -2.143711 -0.428386 1.916506
H  -6.036475 -3.230645 0.421271
H  -6.837115 -1.799199 1.085331
H  -8.216402 -2.847258 -0.688546
H  -7.723564 -1.23185 -1.186816
H  -6.916073 -2.657787 -1.861038
elementType: Cl O N C H
totalener: -2010.47428149 hartree
nucrepener: 2521.74769683 hartree
electener: -4532.22197832 hartree
oneelecener: -7770.47496652 hartree
twoeener: 3238.25298820 hartree
cpcmener: -0.03965380 hartree
kineticenergy: 2004.61500986 hartree
xcener: -146.369084445448 hartree
chargesum: -0.0000000
charge: -0.068924 -0.063875 -0.430049 -0.431103 -0.270814 -0.475638 -0.051160 -0.135781 -0.135362 -0.072519 -0.074882 -0.081496 -0.060353 0.348300 0.339622 0.129699 -0.169292 -0.218682 0.018312 -0.114452 0.033337 -0.017285 -0.059995 0.484847 0.038173 -0.250179 0.102669 0.093661 0.102734 0.093439 0.078624 0.080716 0.078706 0.080748 0.148961 0.157430 0.145392 0.148635 0.106638 0.101749 0.090989 0.089262 0.089194
qa: -0.0689 -0.0639 -0.4300 -0.4311 -0.2708 -0.4756 -0.0512 -0.1358 -0.1354 -0.0725 -0.0749 -0.0815 -0.0604 0.3483 0.3396 0.1297 -0.1693 -0.2187 0.0183 -0.1145 0.0333 -0.0173 -0.0600 0.4848 0.0382 -0.2502 0.1027 0.0937 0.1027 0.0934 0.0786 0.0807 0.0787 0.0807 0.1490 0.1574 0.1454 0.1486 0.1066 0.1017 0.0910 0.0893 0.0892
va: 1.2541 1.2641 2.0810 2.0792 2.1706 2.0352 3.1201 3.9201 3.9184 3.9184 3.9178 3.7177 3.7050 4.1570 4.1608 3.6889 4.0186 4.0432 3.7824 3.9986 3.8938 3.7978 4.0009 4.1461 3.8324 3.9733 1.0036 1.0156 1.0034 1.0158 1.0060 1.0093 1.0061 1.0092 1.0173 1.0075 1.0061 1.0223 0.9949 0.9963 1.0066 1.0032 1.0031
dispcorr: -0.020619332 hartree
energy: -2010.494900820051
dipole: 23.08536 -21.21726 1.86810 -21.38049 20.42609 -0.95440 1.50727 -1.89971 -0.39243
magnitude: 2.13417 au
magnitude: 5.42463 debye
