program: Orca
programVersion: 5.0.2
elementType: Cl Cl O O O O N C C C C C C C C C C C C C C C C C C C H H H H H H H H H H H H H H H H H
charge: 0
multiplicity: 1
keywords: wb97x-d3
keywords: def2-TZVPP
keywords: def2/J RIJCOSX
keywords: DEFGRID2
keywords: scfconv7
keywords: smallprint printgap noloewdin
keywords: NOSOSCF
formula: C19H17Cl2NO4
InChI: InChI=1/C19H17Cl2NO4/c1-2-26-19(25)16(21)10-11-9-12(7-8-15(11)20)22-17(23)13-5-3-4-6-14(13)18(22)24/h7-10H,2-6H2,1H3
43 atoms
Cl -2.808248 3.24899 -0.470141
Cl -1.796786 -1.804105 -1.372034
O  3.364687 1.696156 1.731226
O  2.037936 -1.148938 -1.559142
O  -5.055395 -0.768013 0.427531
O  -4.419274 -2.669921 -0.561592
N  2.345521 0.444504 0.081981
C  6.586655 -1.412256 0.90437
C  6.42981 -1.772852 -0.572204
C  5.852481 -0.117667 1.256692
C  4.967031 -2.02016 -0.943822
C  4.516662 -0.115771 0.612318
C  4.124006 -0.95735 -0.344704
C  3.39717 0.806984 0.918633
C  2.728686 -0.627375 -0.720977
C  1.113269 1.119546 -0.021664
C  -0.067744 0.410579 0.121168
C  1.085727 2.482455 -0.287659
C  -1.302094 1.04027 -0.028624
C  -0.129578 3.133701 -0.398643
C  -1.306503 2.415292 -0.275114
C  -2.562382 0.313354 0.114642
C  -2.870116 -0.884058 -0.388067
C  -4.18978 -1.546632 -0.187317
C  -6.381128 -1.285957 0.665761
C  -7.204967 -0.17885 1.268729
H  6.417061 0.754886 0.912944
H  5.754091 -0.005314 2.338767
H  4.633216 -2.995965 -0.577235
H  4.836061 -2.043283 -2.027973
H  6.192422 -2.226873 1.517904
H  7.642778 -1.312353 1.156665
H  6.822985 -0.958871 -1.187623
H  7.021277 -2.65811 -0.807456
H  -0.030961 -0.637358 0.3818
H  2.003177 3.039223 -0.421044
H  -0.156265 4.195107 -0.602116
H  -3.340192 0.811651 0.680656
H  -6.812408 -1.621806 -0.278392
H  -6.316112 -2.142567 1.338586
H  -7.27792 0.678401 0.599522
H  -8.214492 -0.549764 1.444066
H  -6.801745 0.154418 2.224651
elementType: Cl O N C H
totalener: -2010.47683835 hartree
nucrepener: 2535.59274353 hartree
electener: -4546.06958188 hartree
oneelecener: -7797.95103797 hartree
twoeener: 3251.88145609 hartree
cpcmener: -0.04179533 hartree
kineticenergy: 2004.60122207 hartree
xcener: -146.366902562324 hartree
chargesum: -0.0000000
charge: -0.071004 -0.069189 -0.430427 -0.432481 -0.267349 -0.460945 -0.054901 -0.136105 -0.134959 -0.071388 -0.073485 -0.087987 -0.056310 0.348362 0.335264 0.096317 -0.199981 -0.189498 0.116634 -0.130074 0.041800 -0.088389 -0.033177 0.460205 0.032695 -0.250149 0.102372 0.094661 0.101374 0.093224 0.078383 0.081407 0.078898 0.080814 0.165574 0.162541 0.144962 0.145106 0.100142 0.105951 0.088773 0.092419 0.089918
qa: -0.0710 -0.0692 -0.4304 -0.4325 -0.2673 -0.4609 -0.0549 -0.1361 -0.1350 -0.0714 -0.0735 -0.0880 -0.0563 0.3484 0.3353 0.0963 -0.2000 -0.1895 0.1166 -0.1301 0.0418 -0.0884 -0.0332 0.4602 0.0327 -0.2501 0.1024 0.0947 0.1014 0.0932 0.0784 0.0814 0.0789 0.0808 0.1656 0.1625 0.1450 0.1451 0.1001 0.1060 0.0888 0.0924 0.0899
va: 1.2577 1.2642 2.0817 2.0789 2.1466 2.0473 3.1009 3.9171 3.9149 3.9164 3.9179 3.7146 3.7092 4.1641 4.1612 3.7353 4.0471 4.0590 3.6247 4.0003 3.9722 3.8549 3.9889 4.2097 3.8380 3.9683 1.0044 1.0149 1.0044 1.0157 1.0068 1.0091 1.0069 1.0094 1.0144 1.0016 1.0068 1.0285 0.9959 0.9943 1.0036 1.0067 1.0027
dispcorr: -0.020915840 hartree
energy: -2010.497754191738
dipole: 17.92678 -16.44128 1.48550 -9.48211 10.19778 0.71567 9.98635 -8.94811 1.03825
magnitude: 1.94855 au
magnitude: 4.95282 debye
