program: Orca
programVersion: 5.0.2
elementType: Cl Cl O O O O N C C C C C C C C C C C C C C C C C C C H H H H H H H H H H H H H H H H H
charge: 0
multiplicity: 1
keywords: wb97x-d3
keywords: def2-TZVPP
keywords: def2/J RIJCOSX
keywords: DEFGRID2
keywords: scfconv7
keywords: smallprint printgap noloewdin
keywords: NOSOSCF
formula: C19H17Cl2NO4
InChI: InChI=1/C19H17Cl2NO4/c1-2-26-19(25)16(21)10-11-9-12(7-8-15(11)20)22-17(23)13-5-3-4-6-14(13)18(22)24/h7-10H,2-6H2,1H3
43 atoms
Cl -2.807884 3.318516 -0.423231
Cl -2.043319 -1.550722 -1.720153
O  2.01239 -0.621017 1.94112
O  3.374107 1.192263 -2.002841
O  -4.895053 -0.862817 0.803287
O  -4.635552 -2.413277 -0.787737
N  2.337168 0.461737 -0.072937
C  6.357685 -1.650724 1.127085
C  6.502823 -1.693807 -0.392918
C  4.893283 -1.726558 1.561523
C  5.812914 -0.50617 -1.066566
C  4.080147 -0.82987 0.705554
C  4.485049 -0.288538 -0.443578
C  2.70221 -0.365545 0.986936
C  3.389016 0.552795 -0.981566
C  1.107623 1.141587 -0.179329
C  -0.079277 0.4331 -0.072087
C  1.086082 2.517898 -0.368854
C  -1.307196 1.088571 -0.125745
C  -0.125502 3.180065 -0.456144
C  -1.305778 2.469572 -0.322277
C  -2.56495 0.370993 0.089856
C  -2.959577 -0.760859 -0.494297
C  -4.247918 -1.442968 -0.184765
C  -6.179045 -1.398314 1.184157
C  -6.68984 -0.582577 2.341862
H  4.780577 -1.455304 2.613421
H  4.514992 -2.749601 1.470811
H  5.709537 -0.67075 -2.141216
H  6.411905 0.403089 -0.955636
H  6.915685 -2.470974 1.580326
H  6.796786 -0.72396 1.506846
H  7.557856 -1.705964 -0.668599
H  6.068526 -2.62314 -0.771397
H  -0.054973 -0.636601 0.081245
H  2.005205 3.084013 -0.433103
H  -0.145027 4.249803 -0.611049
H  -3.245971 0.81298 0.807836
H  -6.858572 -1.340861 0.332486
H  -6.064192 -2.446588 1.463163
H  -7.662582 -0.970792 2.642778
H  -6.02598 -0.644662 3.203861
H  -6.81929 0.465679 2.073056
elementType: Cl O N C H
totalener: -2010.47693126 hartree
nucrepener: 2528.35097669 hartree
electener: -4538.82790795 hartree
oneelecener: -7783.19018071 hartree
twoeener: 3244.36227276 hartree
cpcmener: -0.04026403 hartree
kineticenergy: 2004.60098907 hartree
xcener: -146.366689588379 hartree
chargesum: -0.0000000
charge: -0.070513 -0.068820 -0.431329 -0.430736 -0.266736 -0.461285 -0.054210 -0.134645 -0.134167 -0.074198 -0.073657 -0.066045 -0.079357 0.340744 0.346389 0.108169 -0.197173 -0.190031 0.105522 -0.134545 0.038258 -0.085681 -0.033673 0.455384 0.033759 -0.251115 0.093689 0.102056 0.094247 0.102171 0.081116 0.077863 0.080662 0.077952 0.161850 0.160734 0.145160 0.154152 0.104363 0.101851 0.092320 0.089892 0.089611
qa: -0.0705 -0.0688 -0.4313 -0.4307 -0.2667 -0.4613 -0.0542 -0.1346 -0.1342 -0.0742 -0.0737 -0.0660 -0.0794 0.3407 0.3464 0.1082 -0.1972 -0.1900 0.1055 -0.1345 0.0383 -0.0857 -0.0337 0.4554 0.0338 -0.2511 0.0937 0.1021 0.0942 0.1022 0.0811 0.0779 0.0807 0.0780 0.1619 0.1607 0.1452 0.1542 0.1044 0.1019 0.0923 0.0899 0.0896
va: 1.2584 1.2603 2.0811 2.0817 2.1461 2.0472 3.1120 3.9167 3.9161 3.9182 3.9180 3.7046 3.7065 4.1611 4.1631 3.7328 4.0415 4.0522 3.6322 4.0116 3.9699 3.8430 3.9937 4.2184 3.8371 3.9692 1.0156 1.0041 1.0152 1.0042 1.0092 1.0069 1.0094 1.0067 1.0185 1.0039 1.0069 1.0222 0.9949 0.9952 1.0065 1.0033 1.0030
dispcorr: -0.020711726 hartree
energy: -2010.497642983848
dipole: 19.89137 -18.17050 1.72087 -12.01115 12.43680 0.42566 15.34850 -13.69797 1.65052
magnitude: 2.42215 au
magnitude: 6.15662 debye
