program: Orca
programVersion: 5.0.2
elementType: Cl Cl O O O O N C C C C C C C C C C C C C C C C C C C H H H H H H H H H H H H H H H H H
charge: 0
multiplicity: 1
keywords: wb97x-d3
keywords: def2-TZVPP
keywords: def2/J RIJCOSX
keywords: DEFGRID2
keywords: scfconv7
keywords: smallprint printgap noloewdin
keywords: NOSOSCF
formula: C19H17Cl2NO4
InChI: InChI=1/C19H17Cl2NO4/c1-2-26-19(25)16(21)10-11-9-12(7-8-15(11)20)22-17(23)13-5-3-4-6-14(13)18(22)24/h7-10H,2-6H2,1H3
43 atoms
Cl -2.847735 3.111677 -0.84047
Cl -1.748818 -1.29482 1.761513
O  2.004514 -0.68009 1.653125
O  3.451195 1.175389 -2.240619
O  -5.014841 -0.988479 -0.288845
O  -4.438072 -2.258706 1.463168
N  2.365377 0.404708 -0.354045
C  6.167283 -2.184873 0.599717
C  6.840212 -1.018492 -0.121963
C  4.90961 -1.743026 1.350479
C  5.927739 -0.392772 -1.179905
C  4.118582 -0.832332 0.488762
C  4.556614 -0.257245 -0.631323
C  2.718356 -0.408953 0.721372
C  3.450251 0.538326 -1.217695
C  1.119199 1.046205 -0.495339
C  -0.046392 0.300595 -0.412459
C  1.059735 2.420196 -0.689435
C  -1.294863 0.915295 -0.489233
C  -0.169379 3.040427 -0.820409
C  -1.329606 2.293299 -0.718404
C  -2.543952 0.16585 -0.363864
C  -2.840066 -0.776449 0.533743
C  -4.175892 -1.43058 0.627196
C  -6.378123 -1.455187 -0.254648
C  -7.189173 -0.744624 0.803527
H  5.169771 -1.229846 2.281455
H  4.305124 -2.60579 1.640464
H  5.900839 -1.006645 -2.085283
H  6.30689 0.584288 -1.488782
H  5.897855 -2.954364 -0.128837
H  6.865847 -2.645475 1.298849
H  7.118064 -0.254921 0.609574
H  7.765009 -1.353462 -0.592406
H  0.013001 -0.773685 -0.312963
H  1.962403 3.013906 -0.72748
H  -0.221085 4.108412 -0.978432
H  -3.33274 0.434373 -1.05521
H  -6.761276 -1.232063 -1.248006
H  -6.398878 -2.537316 -0.122422
H  -8.231134 -1.051877 0.712363
H  -6.860767 -0.986914 1.813365
H  -7.148592 0.336725 0.673719
elementType: Cl O N C H
totalener: -2010.47572723 hartree
nucrepener: 2541.41811643 hartree
electener: -4551.89384366 hartree
oneelecener: -7809.70283721 hartree
twoeener: 3257.80899354 hartree
cpcmener: -0.04079346 hartree
kineticenergy: 2004.59923703 hartree
xcener: -146.367936492693 hartree
chargesum: 0.0000000
charge: -0.072162 -0.068836 -0.430621 -0.430753 -0.272599 -0.458613 -0.055507 -0.135729 -0.135324 -0.073049 -0.072636 -0.058100 -0.081303 0.330723 0.346955 0.107151 -0.202644 -0.188107 0.117758 -0.133490 0.037945 -0.083240 -0.049596 0.468043 0.034424 -0.249013 0.102553 0.094179 0.102092 0.094434 0.078846 0.081077 0.078818 0.080986 0.163398 0.161121 0.144547 0.144270 0.110586 0.095627 0.098099 0.088407 0.089282
qa: -0.0722 -0.0688 -0.4306 -0.4308 -0.2726 -0.4586 -0.0555 -0.1357 -0.1353 -0.0730 -0.0726 -0.0581 -0.0813 0.3307 0.3470 0.1072 -0.2026 -0.1881 0.1178 -0.1335 0.0379 -0.0832 -0.0496 0.4680 0.0344 -0.2490 0.1026 0.0942 0.1021 0.0944 0.0788 0.0811 0.0788 0.0810 0.1634 0.1611 0.1445 0.1443 0.1106 0.0956 0.0981 0.0884 0.0893
va: 1.2561 1.2654 2.0808 2.0811 2.1419 2.0457 3.1104 3.9163 3.9152 3.9182 3.9162 3.7149 3.7165 4.1633 4.1598 3.7316 4.0376 4.0514 3.6146 4.0087 3.9738 3.8464 3.9892 4.2155 3.8362 3.9175 1.0051 1.0149 1.0051 1.0144 1.0063 1.0093 1.0064 1.0094 1.0164 1.0034 1.0073 1.0330 0.9960 1.0077 1.0068 1.0136 1.0042
dispcorr: -0.021204714 hartree
energy: -2010.496931943376
dipole: 17.79023 -16.30456 1.48567 -12.32581 12.56703 0.24123 -1.29933 0.13618 -1.16315
magnitude: 1.90219 au
magnitude: 4.83499 debye
