program: Orca
programVersion: 5.0.2
elementType: Cl Cl O O O O N C C C C C C C C C C C C C C C C C C C H H H H H H H H H H H H H H H H H
charge: 0
multiplicity: 1
keywords: wb97x-d3
keywords: def2-TZVPP
keywords: def2/J RIJCOSX
keywords: DEFGRID2
keywords: scfconv7
keywords: smallprint printgap noloewdin
keywords: NOSOSCF
formula: C19H17Cl2NO4
InChI: InChI=1/C19H17Cl2NO4/c1-2-26-19(25)16(21)10-11-9-12(7-8-15(11)20)22-17(23)13-5-3-4-6-14(13)18(22)24/h7-10H,2-6H2,1H3
43 atoms
Cl -2.573391 3.717982 0.514501
Cl -2.191264 -1.006692 -1.503425
O  3.296457 1.353088 -1.69254
O  2.05571 -0.823454 2.102014
O  -4.662098 -1.931958 -0.562618
O  -5.078257 -0.413887 1.021844
N  2.337527 0.471439 0.212194
C  6.186613 -2.034807 -0.768128
C  6.187212 -2.1760 0.753167
C  5.588915 -0.70032 -1.217996
C  4.771661 -2.139563 1.332165
C  4.356316 -0.42603 -0.441034
C  3.993231 -1.063721 0.671565
C  3.319079 0.582132 -0.769689
C  2.69413 -0.513051 1.130878
C  1.163865 1.247901 0.2712
C  -0.070509 0.620025 0.319433
C  1.244656 2.634076 0.286136
C  -1.246879 1.361566 0.406257
C  0.086024 3.387524 0.34868
C  -1.14211 2.753292 0.421759
C  -2.550341 0.711024 0.541385
C  -3.032471 -0.307885 -0.170626
C  -4.370587 -0.87845 0.16228
C  -5.910861 -2.604238 -0.312517
C  -5.926546 -3.857121 -1.147182
H  5.36994 -0.710917 -2.288264
H  6.302177 0.115892 -1.06475
H  4.79534 -1.984272 2.413223
H  4.263429 -3.096799 1.177932
H  7.202979 -2.128844 -1.152776
H  5.608588 -2.85284 -1.20725
H  6.6750 -3.107922 1.042273
H  6.776244 -1.365752 1.191972
H  -0.121044 -0.459613 0.313753
H  2.203613 3.133452 0.262105
H  0.144632 4.467075 0.354529
H  -3.203923 1.095502 1.31686
H  -5.993839 -2.841173 0.7489
H  -6.734663 -1.940049 -0.578797
H  -6.866555 -4.382821 -0.979459
H  -5.853303 -3.637108 -2.211851
H  -5.115781 -4.531617 -0.873132
elementType: Cl O N C H
totalener: -2010.48796083 hartree
nucrepener: 2525.62832274 hartree
electener: -4536.11628357 hartree
oneelecener: -7777.85706923 hartree
twoeener: 3241.74078566 hartree
cpcmener: -0.03199250 hartree
kineticenergy: 2004.62113876 hartree
xcener: -146.366994934275 hartree
chargesum: -0.0000000
charge: -0.069129 -0.068175 -0.403674 -0.404194 -0.267883 -0.449533 -0.057540 -0.135517 -0.135941 -0.076328 -0.074154 -0.082169 -0.067682 0.325223 0.317117 0.106260 -0.180989 -0.191784 0.089191 -0.127438 0.037955 -0.074647 -0.045924 0.464791 0.037701 -0.247667 0.093660 0.100808 0.094378 0.100808 0.081035 0.078216 0.081277 0.078218 0.159042 0.156448 0.141689 0.145424 0.098221 0.106031 0.089103 0.089407 0.088366
qa: -0.0691 -0.0682 -0.4037 -0.4042 -0.2679 -0.4495 -0.0575 -0.1355 -0.1359 -0.0763 -0.0742 -0.0822 -0.0677 0.3252 0.3171 0.1063 -0.1810 -0.1918 0.0892 -0.1274 0.0380 -0.0746 -0.0459 0.4648 0.0377 -0.2477 0.0937 0.1008 0.0944 0.1008 0.0810 0.0782 0.0813 0.0782 0.1590 0.1564 0.1417 0.1454 0.0982 0.1060 0.0891 0.0894 0.0884
va: 1.2599 1.2591 2.1160 2.1148 2.1686 2.0659 3.0905 3.9149 3.9150 3.9208 3.9204 3.6876 3.6821 4.1928 4.1946 3.7360 4.0424 4.0648 3.6755 4.0079 3.9745 3.8556 3.9944 4.1780 3.8390 3.9718 1.0154 1.0046 1.0151 1.0047 1.0094 1.0068 1.0093 1.0067 1.0181 1.0049 1.0080 1.0315 0.9976 0.9944 1.0068 1.0031 1.0036
dispcorr: -0.020660504 hartree
energy: -2010.508621336101
dipole: 21.06187 -19.13177 1.93010 -26.67619 25.14958 -1.52661 -0.16935 -0.10759 -0.27694
magnitude: 2.47639 au
magnitude: 6.29449 debye
